Build failure of network:osmocom:nightly/osmo-msc in xUbuntu_18.10/i586

OBS Notification admin at opensuse.org
Tue Jul 9 03:10:07 UTC 2019


Visit https://build.opensuse.org/package/live_build_log/network:osmocom:nightly/osmo-msc/xUbuntu_18.10/i586

Package network:osmocom:nightly/osmo-msc failed to build in xUbuntu_18.10/i586

Check out the package for editing:
  osc checkout network:osmocom:nightly osmo-msc

Last lines of build log:
[  331s] gcc -DHAVE_CONFIG_H -I. -I../..   -I../../include -I../..  -Wdate-time -D_FORTIFY_SOURCE=2 -Wall -I/usr/include/ -I/usr/include/ -I/usr/include/  -I/usr/include/ -I/usr/include/ -I/usr/include/asn1c -I/usr/include/ -I/usr/include/ -I/usr/include/ -I/usr/include/ -I/usr/include/ -I/usr/include/  -g -O2 -fdebug-prefix-map=/usr/src/packages/BUILD=. -fstack-protector-strong -Wformat -Werror=format-security -Werror=implicit -Werror=maybe-uninitialized -Werror=memset-transposed-args -Werror=null-dereference -Werror=sizeof-array-argument -Werror=sizeof-pointer-memaccess -c -o ran_msg_a.o ran_msg_a.c
[  332s] gcc -DHAVE_CONFIG_H -I. -I../..   -I../../include -I../..  -Wdate-time -D_FORTIFY_SOURCE=2 -Wall -I/usr/include/ -I/usr/include/ -I/usr/include/  -I/usr/include/ -I/usr/include/ -I/usr/include/asn1c -I/usr/include/ -I/usr/include/ -I/usr/include/ -I/usr/include/ -I/usr/include/ -I/usr/include/  -g -O2 -fdebug-prefix-map=/usr/src/packages/BUILD=. -fstack-protector-strong -Wformat -Werror=format-security -Werror=implicit -Werror=maybe-uninitialized -Werror=memset-transposed-args -Werror=null-dereference -Werror=sizeof-array-argument -Werror=sizeof-pointer-memaccess -c -o ran_peer.o ran_peer.c
[  332s] In file included from /usr/include/osmocom/core/fsm.h:12,
[  332s]                  from ran_peer.c:25:
[  332s] ran_peer.c: In function 'ran_peer_st_ready':
[  332s] ran_peer.c:374:3: error: expected ';' before 'do'
[  332s]    OSMO_ASSERT(!ctx->conn);
[  332s]    ^~~~~~~~~~~
[  332s] make[4]: *** [Makefile:570: ran_peer.o] Error 1
[  332s] make[4]: Leaving directory '/usr/src/packages/BUILD/src/libmsc'
[  332s] make[3]: *** [Makefile:422: all-recursive] Error 1
[  332s] make[3]: Leaving directory '/usr/src/packages/BUILD/src'
[  332s] make[2]: *** [Makefile:462: all-recursive] Error 1
[  332s] make[2]: Leaving directory '/usr/src/packages/BUILD'
[  332s] make[1]: *** [Makefile:394: all] Error 2
[  332s] make[1]: Leaving directory '/usr/src/packages/BUILD'
[  332s] dh_auto_build: make -j1 returned exit code 2
[  332s] make: *** [debian/rules:45: build] Error 2
[  332s] dpkg-buildpackage: error: debian/rules build subprocess returned exit status 2
[  332s] 
[  332s] morla5 failed "build osmo-msc_1.3.1.175.1c500.dsc" at Tue Jul  9 03:09:59 UTC 2019.
[  332s] 
[  332s] ### VM INTERACTION START ###
[  335s] [  320.150551] sysrq: SysRq : Power Off
[  335s] [  320.156256] reboot: Power down
[  335s] ### VM INTERACTION END ###
[  335s] 
[  335s] morla5 failed "build osmo-msc_1.3.1.175.1c500.dsc" at Tue Jul  9 03:10:02 UTC 2019.
[  335s] 

-- 
Configure notifications at https://build.opensuse.org/user/notifications
openSUSE Build Service (https://build.opensuse.org/)


More information about the gerrit-log mailing list