Build failure of network:osmocom:nightly/simtrace2 in Debian_Unstable/x86_64

OBS Notification admin at opensuse.org
Tue Jul 9 02:36:58 UTC 2019


Visit https://build.opensuse.org/package/live_build_log/network:osmocom:nightly/simtrace2/Debian_Unstable/x86_64

Package network:osmocom:nightly/simtrace2 failed to build in Debian_Unstable/x86_64

Check out the package for editing:
  osc checkout network:osmocom:nightly simtrace2

Last lines of build log:
[   14s] objdump: /boot/vmlinuz: warning: ignoring section flag IMAGE_SCN_MEM_NOT_PAGED in section .bss
[   14s] booting kvm...
[   14s] ### VM INTERACTION START ###
[   14s] /usr/bin/qemu-kvm -nodefaults -no-reboot -nographic -vga none -cpu host,-smap -object rng-random,filename=/dev/random,id=rng0 -device virtio-rng-pci,rng=rng0 -runas qemu -net none -kernel /boot/vmlinuz -initrd /boot/initrd -append root=/dev/sda rootfstype=ext3 rootflags=data=writeback,nobarrier,commit=150,noatime ext4.allow_unsupported=1 kpti=off pti=off spectre_v2=off panic=1 quiet no-kvmclock elevator=noop nmi_watchdog=0 rw rd.driver.pre=binfmt_misc console=ttyS0 init=/.build/build -m 8192 -drive file=/var/cache/obs/worker/root_3/root,format=raw,if=none,id=disk,cache=unsafe -device ide-hd,drive=disk,serial=0 -drive file=/var/cache/obs/worker/root_3/swap,format=raw,if=none,id=swap,cache=unsafe -device ide-hd,drive=swap,serial=1 -serial stdio -chardev socket,id=monitor,server,nowait,path=/var/cache/obs/worker/root_3/root.qemu/monitor -mon chardev=monitor,mode=readline -smp 8
[   15s] c[?7lSeaBIOS (version rel-1.12.0-0-ga698c89-prebuilt.qemu.org)
[   21s] Booting from ROM..c[?7l### VM INTERACTION END ###
[   21s] 2nd stage started in virtual machine
[   21s] machine type: x86_64
[   21s] Linux version: 4[    5.158882] sysrq: SysRq : Changing Loglevel
[   21s] .12.14-1.g2114e9[    5.159997] sysrq: Loglevel set to 4
[   21s] 4-default #1 SMP Mon Jun 3 08:29:36 UTC 2019 (2114e94)
[   21s] Increasing log level from now on...
[   21s] mount: error while loading shared libraries: libpcre2-8.so.0: cannot open shared object file: No such file or directory
[   21s] mkdir: error while loading shared libraries: libpcre2-8.so.0: cannot open shared object file: No such file or directory
[   21s] mkdir: error while loading shared libraries: libpcre2-8.so.0: cannot open shared object file: No such file or directory
[   21s] mount: error while loading shared libraries: libpcre2-8.so.0: cannot open shared object file: No such file or directory
[   21s] mount: error while loading shared libraries: libpcre2-8.so.0: cannot open shared object file: No such file or directory
[   21s] mkswap: error while loading shared libraries: libpcre2-8.so.0: cannot open shared object file: No such file or directory
[   21s] swapon: error while loading shared libraries: libpcre2-8.so.0: cannot open shared object file: No such file or directory
[   21s] 
[   21s]  failed "build simtrace2_0.5.1.29.155f.dsc" at Tue Jul  9 02:36:53 UTC 2019.
[   21s] 
[   21s] ### VM INTERACTION START ###
[   25s] [    8.246833] sysrq: SysRq : Power Off
[   25s] [    8.252584] reboot: Power down
[   25s] ### VM INTERACTION END ###
[   25s] 
[   25s] lamb01 failed "build simtrace2_0.5.1.29.155f.dsc" at Tue Jul  9 02:36:57 UTC 2019.
[   25s] 

-- 
Configure notifications at https://build.opensuse.org/user/notifications
openSUSE Build Service (https://build.opensuse.org/)


More information about the gerrit-log mailing list