Build failure of network:osmocom:nightly/osmo-hlr in Debian_Unstable/x86_64

OBS Notification admin at opensuse.org
Tue Aug 13 16:55:08 UTC 2019


Visit https://build.opensuse.org/package/live_build_log/network:osmocom:nightly/osmo-hlr/Debian_Unstable/x86_64

Package network:osmocom:nightly/osmo-hlr failed to build in Debian_Unstable/x86_64

Check out the package for editing:
  osc checkout network:osmocom:nightly osmo-hlr

Last lines of build log:
[  362s] | #define HAVE_STDLIB_H 1
[  362s] | #define HAVE_STRING_H 1
[  362s] | #define HAVE_MEMORY_H 1
[  362s] | #define HAVE_STRINGS_H 1
[  362s] | #define HAVE_INTTYPES_H 1
[  362s] | #define HAVE_STDINT_H 1
[  362s] | #define HAVE_UNISTD_H 1
[  362s] | #define HAVE_DLFCN_H 1
[  362s] | #define LT_OBJDIR ".libs/"
[  362s] | #define PACKAGE "osmo-hlr"
[  362s] | #define VERSION "1.1.0.2-b07f"
[  362s] | #define STDC_HEADERS 1
[  362s] | 
[  362s] | configure: exit 0
[  362s] 
[  362s] make[1]: *** [debian/rules:17: override_dh_auto_test] Error 1
[  362s] make[1]: Leaving directory '/usr/src/packages/BUILD'
[  362s] make: *** [debian/rules:7: build] Error 2
[  362s] dpkg-buildpackage: error: debian/rules build subprocess returned exit status 2
[  362s] 
[  362s] lamb06 failed "build osmo-hlr_1.1.0.2.b07f.dsc" at Tue Aug 13 16:54:59 UTC 2019.
[  362s] 
[  362s] ### VM INTERACTION START ###
[  365s] [  348.034262] sysrq: SysRq : Power Off
[  365s] [  348.049277] reboot: Power down
[  365s] ### VM INTERACTION END ###
[  365s] 
[  365s] lamb06 failed "build osmo-hlr_1.1.0.2.b07f.dsc" at Tue Aug 13 16:55:02 UTC 2019.
[  365s] 

-- 
Configure notifications at https://build.opensuse.org/user/notifications
openSUSE Build Service (https://build.opensuse.org/)


More information about the gerrit-log mailing list