Build failure of network:osmocom:nightly/osmo-hlr in Debian_9.0/aarch64

OBS Notification admin at opensuse.org
Tue Aug 13 01:52:00 UTC 2019


Visit https://build.opensuse.org/package/live_build_log/network:osmocom:nightly/osmo-hlr/Debian_9.0/aarch64

Package network:osmocom:nightly/osmo-hlr failed to build in Debian_9.0/aarch64

Check out the package for editing:
  osc checkout network:osmocom:nightly osmo-hlr

Last lines of build log:
[  252s] | #define HAVE_MEMORY_H 1
[  252s] | #define HAVE_STRINGS_H 1
[  252s] | #define HAVE_INTTYPES_H 1
[  252s] | #define HAVE_STDINT_H 1
[  252s] | #define HAVE_UNISTD_H 1
[  252s] | #define HAVE_DLFCN_H 1
[  252s] | #define LT_OBJDIR ".libs/"
[  252s] | #define PACKAGE "osmo-hlr"
[  252s] | #define VERSION "1.1.0.2-b07f"
[  252s] | #define STDC_HEADERS 1
[  252s] | 
[  252s] | configure: exit 0
[  252s] 
[  252s] debian/rules:17: recipe for target 'override_dh_auto_test' failed
[  252s] make[1]: *** [override_dh_auto_test] Error 1
[  252s] make[1]: Leaving directory '/usr/src/packages/BUILD'
[  252s] debian/rules:7: recipe for target 'build' failed
[  252s] make: *** [build] Error 2
[  252s] dpkg-buildpackage: error: debian/rules build gave error exit status 2
[  252s] 
[  252s] obs-arm-7 failed "build osmo-hlr_1.1.0.2.b07f.dsc" at Tue Aug 13 01:51:51 UTC 2019.
[  252s] 
[  252s] ### VM INTERACTION START ###
[  255s] [  244.449908] sysrq: Power Off
[  255s] [  244.496612] reboot: Power down
[  255s] ### VM INTERACTION END ###
[  255s] 
[  255s] obs-arm-7 failed "build osmo-hlr_1.1.0.2.b07f.dsc" at Tue Aug 13 01:51:54 UTC 2019.
[  255s] 

-- 
Configure notifications at https://build.opensuse.org/user/notifications
openSUSE Build Service (https://build.opensuse.org/)


More information about the gerrit-log mailing list