Build failure of network:osmocom:nightly/osmo-hlr in Debian_9.0/i586

OBS Notification admin at opensuse.org
Tue Aug 13 01:47:09 UTC 2019


Visit https://build.opensuse.org/package/live_build_log/network:osmocom:nightly/osmo-hlr/Debian_9.0/i586

Package network:osmocom:nightly/osmo-hlr failed to build in Debian_9.0/i586

Check out the package for editing:
  osc checkout network:osmocom:nightly osmo-hlr

Last lines of build log:
[  241s] | #define HAVE_MEMORY_H 1
[  241s] | #define HAVE_STRINGS_H 1
[  241s] | #define HAVE_INTTYPES_H 1
[  241s] | #define HAVE_STDINT_H 1
[  241s] | #define HAVE_UNISTD_H 1
[  241s] | #define HAVE_DLFCN_H 1
[  241s] | #define LT_OBJDIR ".libs/"
[  241s] | #define PACKAGE "osmo-hlr"
[  241s] | #define VERSION "1.1.0.2-b07f"
[  241s] | #define STDC_HEADERS 1
[  241s] | 
[  241s] | configure: exit 0
[  241s] 
[  241s] debian/rules:17: recipe for target 'override_dh_auto_test' failed
[  241s] make[1]: *** [override_dh_auto_test] Error 1
[  241s] make[1]: Leaving directory '/usr/src/packages/BUILD'
[  241s] debian/rules:7: recipe for target 'build' failed
[  241s] make: *** [build] Error 2
[  241s] dpkg-buildpackage: error: debian/rules build gave error exit status 2
[  241s] 
[  241s] lamb54 failed "build osmo-hlr_1.1.0.2.b07f.dsc" at Tue Aug 13 01:47:03 UTC 2019.
[  241s] 
[  241s] ### VM INTERACTION START ###
[  244s] [  230.524536] sysrq: SysRq : Power Off
[  244s] [  230.530221] reboot: Power down
[  244s] ### VM INTERACTION END ###
[  244s] 
[  244s] lamb54 failed "build osmo-hlr_1.1.0.2.b07f.dsc" at Tue Aug 13 01:47:07 UTC 2019.
[  244s] 

-- 
Configure notifications at https://build.opensuse.org/user/notifications
openSUSE Build Service (https://build.opensuse.org/)


More information about the gerrit-log mailing list