Build failure of network:osmocom:nightly/libosmo-netif in xUbuntu_16.04/i586

OBS Notification admin at opensuse.org
Sun Aug 11 01:43:32 UTC 2019


Visit https://build.opensuse.org/package/live_build_log/network:osmocom:nightly/libosmo-netif/xUbuntu_16.04/i586

Package network:osmocom:nightly/libosmo-netif failed to build in xUbuntu_16.04/i586

Check out the package for editing:
  osc checkout network:osmocom:nightly libosmo-netif

Last lines of build log:
[  118s]  [NA] Client's read_cb_cli(): received 11(11) bytes: 72 65 61 64 5f 63 62 5f 73 72 76 
[  118s]  [NA] Client's read_cb_cli(): initial read, contacting server
[  118s]  [OK] Client's read_cb_cli(): sent 29 bytes message: 44 6f 68 2c 20 72 65 73 70 6f 6e 64 69 6e 67 20 74 6f 20 73 65 72 76 65 72 20 3a 2d 44 
[  118s] -[OK|OK] Server's read_cb_srv(): callback triggered
[  118s] -[OK|OK] Server's read_cb_srv(): received 29(29) bytes: 44 6f 68 2c 20 72 65 73 70 6f 6e 64 69 6e 67 20 74 6f 20 73 65 72 76 65 72 20 3a 2d 44 
[  118s] -[OK|OK] Server's read_cb_srv(): sent 11 bytes message: 72 65 61 64 5f 63 62 5f 73 72 76 
[  118s] -[OK|OK] Server's read_cb_srv(): force client disconnect on subsequent call
[  118s] -[OK] Client's read_cb_cli(): callback triggered
[  118s] -[OK] Client's read_cb_cli(): 0-byte read, auto-reconnect will be triggered if enabled
[  118s]  non-reconnecting test complete.
[  118s]  
[  118s]  Stream tests completed
[  118s] 1. testsuite.at:4: 1. stream_test (testsuite.at:4): FAILED (testsuite.at:8)
[  118s] debian/rules:27: recipe for target 'override_dh_auto_test' failed
[  118s] make[1]: *** [override_dh_auto_test] Error 1
[  118s] make[1]: Leaving directory '/usr/src/packages/BUILD'
[  118s] debian/rules:13: recipe for target 'build' failed
[  118s] make: *** [build] Error 2
[  118s] dpkg-buildpackage: error: debian/rules build gave error exit status 2
[  118s] 
[  118s] lamb14 failed "build libosmo-netif_0.6.0.dsc" at Sun Aug 11 01:43:15 UTC 2019.
[  118s] 
[  118s] ### VM INTERACTION START ###
[  120s] [  109.773492] sysrq: SysRq : Power Off
[  120s] [  109.778465] reboot: Power down
[  121s] ### VM INTERACTION END ###
[  121s] 
[  121s] lamb14 failed "build libosmo-netif_0.6.0.dsc" at Sun Aug 11 01:43:19 UTC 2019.
[  121s] 

-- 
Configure notifications at https://build.opensuse.org/user/notifications
openSUSE Build Service (https://build.opensuse.org/)


More information about the gerrit-log mailing list