Build failure of network:osmocom:nightly/osmo-gsm-manuals in Raspbian_10/armv7l

OBS Notification admin at opensuse.org
Fri Aug 9 01:54:31 UTC 2019


Visit https://build.opensuse.org/package/live_build_log/network:osmocom:nightly/osmo-gsm-manuals/Raspbian_10/armv7l

Package network:osmocom:nightly/osmo-gsm-manuals failed to build in Raspbian_10/armv7l

Check out the package for editing:
  osc checkout network:osmocom:nightly osmo-gsm-manuals

Last lines of build log:
[  523s] asciidoc: sigtran-osmocom.adoc: line 220: evaluating: {set2:target:test-usermanual__53.png}
[  523s] asciidoc: sigtran-simple-2g.dot: line 22: filtering: "/usr/bin/python2" "/etc/asciidoc/filters/graphviz/graphviz2png.py" -v -o "/usr/src/packages/BUILD/tests/test-usermanual__53.png" -L dot -F png -
[  523s] Execute: dot -Tpng "/usr/src/packages/BUILD/tests/test-usermanual__53.txt" > "/usr/src/packages/BUILD/tests/test-usermanual__53.png"
[  523s] asciidoc: include: /usr/src/packages/BUILD/common/chapters/sigtran-simple-3g.dot
[  523s] asciidoc: sigtran-osmocom.adoc: line 251: reading: /usr/src/packages/BUILD/common/chapters/sigtran-simple-3g.dot
[  523s] asciidoc: sigtran-osmocom.adoc: line 250: evaluating: {counter2:target-number}
[  523s] asciidoc: sigtran-osmocom.adoc: line 250: evaluating: {set2:target:test-usermanual__54.png}
[  523s] asciidoc: sigtran-simple-3g.dot: line 24: filtering: "/usr/bin/python2" "/etc/asciidoc/filters/graphviz/graphviz2png.py" -v -o "/usr/src/packages/BUILD/tests/test-usermanual__54.png" -L dot -F png -
[  523s] Execute: dot -Tpng "/usr/src/packages/BUILD/tests/test-usermanual__54.txt" > "/usr/src/packages/BUILD/tests/test-usermanual__54.png"
[  523s] 
[  523s] make[3]: *** [../build/Makefile.asciidoc.inc:69: test-usermanual.pdf] Error 1
[  523s] make[3]: Leaving directory '/usr/src/packages/BUILD/tests'
[  523s] make[2]: *** [Makefile:438: all-recursive] Error 1
[  523s] make[2]: Leaving directory '/usr/src/packages/BUILD'
[  523s] make[1]: *** [Makefile:362: all] Error 2
[  523s] make[1]: Leaving directory '/usr/src/packages/BUILD'
[  523s] dh_auto_build: make -j1 returned exit code 2
[  523s] make: *** [debian/rules:5: binary] Error 2
[  523s] dpkg-buildpackage: error: fakeroot debian/rules binary subprocess returned exit status 2
[  523s] 
[  523s] armbuild21 failed "build osmo-gsm-manuals-dev_0.2.0.dsc" at Fri Aug  9 01:54:13 UTC 2019.
[  523s] 
[  523s] ### VM INTERACTION START ###
[  526s] [  501.204638] sysrq: SysRq : Power Off
[  526s] [  501.238991] reboot: Power down
[  527s] ### VM INTERACTION END ###
[  527s] 
[  527s] armbuild21 failed "build osmo-gsm-manuals-dev_0.2.0.dsc" at Fri Aug  9 01:54:17 UTC 2019.
[  527s] 

-- 
Configure notifications at https://build.opensuse.org/user/notifications
openSUSE Build Service (https://build.opensuse.org/)


More information about the gerrit-log mailing list