Build failure of network:osmocom:latest/osmo-bsc in Debian_Unstable/x86_64

OBS Notification admin at
Fri Aug 9 00:45:40 UTC 2019


Package network:osmocom:latest/osmo-bsc failed to build in Debian_Unstable/x86_64

Check out the package for editing:
  osc checkout network:osmocom:latest osmo-bsc

Last lines of build log:
[  286s] gcc -DHAVE_CONFIG_H -I. -I../..   -I../../include -I../..  -Wdate-time -D_FORTIFY_SOURCE=2 -Wall -I/usr/include/ -I/usr/include/ -I/usr/include/ -I/usr/include/ -I/usr/include/  -I/usr/include/ -I/usr/include/ -I/usr/include/  -g -O2 -fdebug-prefix-map=/usr/src/packages/BUILD=. -fstack-protector-strong -Wformat -Werror=format-security -Werror=implicit -Werror=maybe-uninitialized -Werror=memset-transposed-args -Wnull-dereference -Werror=sizeof-array-argument -Werror=sizeof-pointer-memaccess -c -o abis_rsl.o abis_rsl.c
[  287s] gcc -DHAVE_CONFIG_H -I. -I../..   -I../../include -I../..  -Wdate-time -D_FORTIFY_SOURCE=2 -Wall -I/usr/include/ -I/usr/include/ -I/usr/include/ -I/usr/include/ -I/usr/include/  -I/usr/include/ -I/usr/include/ -I/usr/include/  -g -O2 -fdebug-prefix-map=/usr/src/packages/BUILD=. -fstack-protector-strong -Wformat -Werror=format-security -Werror=implicit -Werror=maybe-uninitialized -Werror=memset-transposed-args -Wnull-dereference -Werror=sizeof-array-argument -Werror=sizeof-pointer-memaccess -c -o acc_ramp.o acc_ramp.c
[  288s] gcc -DHAVE_CONFIG_H -I. -I../..   -I../../include -I../..  -Wdate-time -D_FORTIFY_SOURCE=2 -Wall -I/usr/include/ -I/usr/include/ -I/usr/include/ -I/usr/include/ -I/usr/include/  -I/usr/include/ -I/usr/include/ -I/usr/include/  -g -O2 -fdebug-prefix-map=/usr/src/packages/BUILD=. -fstack-protector-strong -Wformat -Werror=format-security -Werror=implicit -Werror=maybe-uninitialized -Werror=memset-transposed-args -Wnull-dereference -Werror=sizeof-array-argument -Werror=sizeof-pointer-memaccess -c -o arfcn_range_encode.o arfcn_range_encode.c
[  288s] gcc -DHAVE_CONFIG_H -I. -I../..   -I../../include -I../..  -Wdate-time -D_FORTIFY_SOURCE=2 -Wall -I/usr/include/ -I/usr/include/ -I/usr/include/ -I/usr/include/ -I/usr/include/  -I/usr/include/ -I/usr/include/ -I/usr/include/  -g -O2 -fdebug-prefix-map=/usr/src/packages/BUILD=. -fstack-protector-strong -Wformat -Werror=format-security -Werror=implicit -Werror=maybe-uninitialized -Werror=memset-transposed-args -Wnull-dereference -Werror=sizeof-array-argument -Werror=sizeof-pointer-memaccess -c -o assignment_fsm.o assignment_fsm.c
[  288s] assignment_fsm.c:26:10: fatal error: osmocom/mgcp_client/mgcp_client_endpoint_fsm.h: No such file or directory
[  288s]  #include <osmocom/mgcp_client/mgcp_client_endpoint_fsm.h>
[  288s]           ^~~~~~~~~~~~~~~~~~~~~~~~~~~~~~~~~~~~~~~~~~~~~~~~
[  288s] compilation terminated.
[  288s] make[4]: *** [Makefile:662: assignment_fsm.o] Error 1
[  288s] make[4]: Leaving directory '/usr/src/packages/BUILD/src/osmo-bsc'
[  288s] make[3]: *** [Makefile:405: all-recursive] Error 1
[  288s] make[3]: Leaving directory '/usr/src/packages/BUILD/src'
[  288s] make[2]: *** [Makefile:448: all-recursive] Error 1
[  288s] make[2]: Leaving directory '/usr/src/packages/BUILD'
[  288s] make[1]: *** [Makefile:380: all] Error 2
[  288s] make[1]: Leaving directory '/usr/src/packages/BUILD'
[  288s] dh_auto_build: make -j1 returned exit code 2
[  288s] make: *** [debian/rules:45: build] Error 255
[  288s] dpkg-buildpackage: error: debian/rules build subprocess returned exit status 2
[  288s] 
[  288s] build77 failed "build osmo-bsc_1.5.0.dsc" at Fri Aug  9 00:45:32 UTC 2019.
[  288s] 
[  288s] ### VM INTERACTION START ###
[  291s] [  275.716113] sysrq: SysRq : Power Off
[  291s] [  275.718042] reboot: Power down
[  291s] ### VM INTERACTION END ###
[  291s] 
[  291s] build77 failed "build osmo-bsc_1.5.0.dsc" at Fri Aug  9 00:45:35 UTC 2019.
[  291s] 

Configure notifications at
openSUSE Build Service (

More information about the gerrit-log mailing list