Build failure of network:osmocom:latest/osmo-mgw in Debian_Unstable/x86_64

OBS Notification admin at opensuse.org
Fri Aug 9 00:39:40 UTC 2019


Visit https://build.opensuse.org/package/live_build_log/network:osmocom:latest/osmo-mgw/Debian_Unstable/x86_64

Package network:osmocom:latest/osmo-mgw failed to build in Debian_Unstable/x86_64

Check out the package for editing:
  osc checkout network:osmocom:latest osmo-mgw

Last lines of build log:
[  320s] asciidoc -v -f /usr/share/osmo-gsm-manuals/build/mscgen-filter.conf -f /usr/share/osmo-gsm-manuals/build/diag-filter.conf -f /usr/share/osmo-gsm-manuals/build/docinfo-releaseinfo.conf -f /usr/share/osmo-gsm-manuals/build/python2-filter.conf -a srcdir='.' osmomgw-usermanual.adoc > osmomgw-usermanual.check 2>&1
[  325s] # Make absolutely sure that the %.check target is updated.
[  325s] touch osmomgw-usermanual.check
[  325s] # Do print the WARNING output but return error if any was found
[  325s] # (grep -v would omit the WARNING output from the log).
[  325s] asciidoc: WARNING: osmomgw-usermanual.adoc: line 23: include file not found: /usr/src/packages/BUILD/doc/manuals/common/chapters/osmux/osmux.adoc
[  325s] make[5]: *** [/usr/share/osmo-gsm-manuals/build/Makefile.asciidoc.inc:95: osmomgw-usermanual.check] Error 1
[  325s] make[5]: Leaving directory '/usr/src/packages/BUILD/doc/manuals'
[  325s] make[4]: *** [Makefile:380: check-recursive] Error 1
[  325s] make[4]: Leaving directory '/usr/src/packages/BUILD/doc'
[  325s] make[3]: *** [Makefile:499: check-recursive] Error 1
[  325s] make[3]: Leaving directory '/usr/src/packages/BUILD'
[  325s] make[2]: *** [Makefile:793: check] Error 2
[  325s] make[2]: Leaving directory '/usr/src/packages/BUILD'
[  325s] dh_auto_test: make -j1 check VERBOSE=1 returned exit code 2
[  325s] make[1]: *** [debian/rules:30: override_dh_auto_test] Error 1
[  325s] make[1]: Leaving directory '/usr/src/packages/BUILD'
[  325s] make: *** [debian/rules:17: build] Error 2
[  325s] dpkg-buildpackage: error: debian/rules build subprocess returned exit status 2
[  325s] 
[  325s] lamb16 failed "build osmo-mgw_1.6.0.dsc" at Fri Aug  9 00:39:34 UTC 2019.
[  325s] 
[  325s] ### VM INTERACTION START ###
[  328s] [  310.891033] sysrq: SysRq : Power Off
[  328s] [  310.895480] reboot: Power down
[  328s] ### VM INTERACTION END ###
[  328s] 
[  328s] lamb16 failed "build osmo-mgw_1.6.0.dsc" at Fri Aug  9 00:39:37 UTC 2019.
[  328s] 

-- 
Configure notifications at https://build.opensuse.org/user/notifications
openSUSE Build Service (https://build.opensuse.org/)


More information about the gerrit-log mailing list