Build failure of network:osmocom:latest/osmo-bsc in Debian_Testing/x86_64

OBS Notification admin at
Thu Aug 8 08:38:24 UTC 2019


Package network:osmocom:latest/osmo-bsc failed to build in Debian_Testing/x86_64

Check out the package for editing:
  osc checkout network:osmocom:latest osmo-bsc

Last lines of build log:
[  381s] gcc -DHAVE_CONFIG_H -I. -I../..   -I../../include -I../..  -Wdate-time -D_FORTIFY_SOURCE=2 -Wall -I/usr/include/ -I/usr/include/ -I/usr/include/ -I/usr/include/ -I/usr/include/  -I/usr/include/ -I/usr/include/ -I/usr/include/  -g -O2 -fdebug-prefix-map=/usr/src/packages/BUILD=. -fstack-protector-strong -Wformat -Werror=format-security -Werror=implicit -Werror=maybe-uninitialized -Werror=memset-transposed-args -Wnull-dereference -Werror=sizeof-array-argument -Werror=sizeof-pointer-memaccess -c -o abis_rsl.o abis_rsl.c
[  382s] gcc -DHAVE_CONFIG_H -I. -I../..   -I../../include -I../..  -Wdate-time -D_FORTIFY_SOURCE=2 -Wall -I/usr/include/ -I/usr/include/ -I/usr/include/ -I/usr/include/ -I/usr/include/  -I/usr/include/ -I/usr/include/ -I/usr/include/  -g -O2 -fdebug-prefix-map=/usr/src/packages/BUILD=. -fstack-protector-strong -Wformat -Werror=format-security -Werror=implicit -Werror=maybe-uninitialized -Werror=memset-transposed-args -Wnull-dereference -Werror=sizeof-array-argument -Werror=sizeof-pointer-memaccess -c -o acc_ramp.o acc_ramp.c
[  383s] gcc -DHAVE_CONFIG_H -I. -I../..   -I../../include -I../..  -Wdate-time -D_FORTIFY_SOURCE=2 -Wall -I/usr/include/ -I/usr/include/ -I/usr/include/ -I/usr/include/ -I/usr/include/  -I/usr/include/ -I/usr/include/ -I/usr/include/  -g -O2 -fdebug-prefix-map=/usr/src/packages/BUILD=. -fstack-protector-strong -Wformat -Werror=format-security -Werror=implicit -Werror=maybe-uninitialized -Werror=memset-transposed-args -Wnull-dereference -Werror=sizeof-array-argument -Werror=sizeof-pointer-memaccess -c -o arfcn_range_encode.o arfcn_range_encode.c
[  383s] gcc -DHAVE_CONFIG_H -I. -I../..   -I../../include -I../..  -Wdate-time -D_FORTIFY_SOURCE=2 -Wall -I/usr/include/ -I/usr/include/ -I/usr/include/ -I/usr/include/ -I/usr/include/  -I/usr/include/ -I/usr/include/ -I/usr/include/  -g -O2 -fdebug-prefix-map=/usr/src/packages/BUILD=. -fstack-protector-strong -Wformat -Werror=format-security -Werror=implicit -Werror=maybe-uninitialized -Werror=memset-transposed-args -Wnull-dereference -Werror=sizeof-array-argument -Werror=sizeof-pointer-memaccess -c -o assignment_fsm.o assignment_fsm.c
[  383s] assignment_fsm.c:26:10: fatal error: osmocom/mgcp_client/mgcp_client_endpoint_fsm.h: No such file or directory
[  383s]  #include <osmocom/mgcp_client/mgcp_client_endpoint_fsm.h>
[  383s]           ^~~~~~~~~~~~~~~~~~~~~~~~~~~~~~~~~~~~~~~~~~~~~~~~
[  383s] compilation terminated.
[  383s] make[4]: *** [Makefile:662: assignment_fsm.o] Error 1
[  383s] make[4]: Leaving directory '/usr/src/packages/BUILD/src/osmo-bsc'
[  383s] make[3]: *** [Makefile:405: all-recursive] Error 1
[  383s] make[3]: Leaving directory '/usr/src/packages/BUILD/src'
[  383s] make[2]: *** [Makefile:448: all-recursive] Error 1
[  383s] make[2]: Leaving directory '/usr/src/packages/BUILD'
[  383s] make[1]: *** [Makefile:380: all] Error 2
[  383s] make[1]: Leaving directory '/usr/src/packages/BUILD'
[  383s] dh_auto_build: make -j1 returned exit code 2
[  383s] make: *** [debian/rules:45: build] Error 255
[  383s] dpkg-buildpackage: error: debian/rules build subprocess returned exit status 2
[  383s] 
[  383s] lamb13 failed "build osmo-bsc_1.5.0.dsc" at Thu Aug  8 08:38:11 UTC 2019.
[  383s] 
[  383s] ### VM INTERACTION START ###
[  386s] [  368.356590] sysrq: SysRq : Power Off
[  386s] [  368.364770] reboot: Power down
[  386s] ### VM INTERACTION END ###
[  386s] 
[  386s] lamb13 failed "build osmo-bsc_1.5.0.dsc" at Thu Aug  8 08:38:15 UTC 2019.
[  386s] 

Configure notifications at
openSUSE Build Service (

More information about the gerrit-log mailing list