Build failure of network:osmocom:latest/osmo-bsc in Debian_10/armv7l

OBS Notification admin at
Thu Aug 8 04:50:26 UTC 2019


Package network:osmocom:latest/osmo-bsc failed to build in Debian_10/armv7l

Check out the package for editing:
  osc checkout network:osmocom:latest osmo-bsc

Last lines of build log:
[ 1116s] gcc -DHAVE_CONFIG_H -I. -I../..   -I../../include -I../..  -Wdate-time -D_FORTIFY_SOURCE=2 -Wall -I/usr/include/ -I/usr/include/ -I/usr/include/ -I/usr/include/ -I/usr/include/  -I/usr/include/ -I/usr/include/ -I/usr/include/  -g -O2 -fdebug-prefix-map=/usr/src/packages/BUILD=. -fstack-protector-strong -Wformat -Werror=format-security -Werror=implicit -Werror=maybe-uninitialized -Werror=memset-transposed-args -Wnull-dereference -Werror=sizeof-array-argument -Werror=sizeof-pointer-memaccess -c -o abis_rsl.o abis_rsl.c
[ 1120s] gcc -DHAVE_CONFIG_H -I. -I../..   -I../../include -I../..  -Wdate-time -D_FORTIFY_SOURCE=2 -Wall -I/usr/include/ -I/usr/include/ -I/usr/include/ -I/usr/include/ -I/usr/include/  -I/usr/include/ -I/usr/include/ -I/usr/include/  -g -O2 -fdebug-prefix-map=/usr/src/packages/BUILD=. -fstack-protector-strong -Wformat -Werror=format-security -Werror=implicit -Werror=maybe-uninitialized -Werror=memset-transposed-args -Wnull-dereference -Werror=sizeof-array-argument -Werror=sizeof-pointer-memaccess -c -o acc_ramp.o acc_ramp.c
[ 1122s] gcc -DHAVE_CONFIG_H -I. -I../..   -I../../include -I../..  -Wdate-time -D_FORTIFY_SOURCE=2 -Wall -I/usr/include/ -I/usr/include/ -I/usr/include/ -I/usr/include/ -I/usr/include/  -I/usr/include/ -I/usr/include/ -I/usr/include/  -g -O2 -fdebug-prefix-map=/usr/src/packages/BUILD=. -fstack-protector-strong -Wformat -Werror=format-security -Werror=implicit -Werror=maybe-uninitialized -Werror=memset-transposed-args -Wnull-dereference -Werror=sizeof-array-argument -Werror=sizeof-pointer-memaccess -c -o arfcn_range_encode.o arfcn_range_encode.c
[ 1122s] gcc -DHAVE_CONFIG_H -I. -I../..   -I../../include -I../..  -Wdate-time -D_FORTIFY_SOURCE=2 -Wall -I/usr/include/ -I/usr/include/ -I/usr/include/ -I/usr/include/ -I/usr/include/  -I/usr/include/ -I/usr/include/ -I/usr/include/  -g -O2 -fdebug-prefix-map=/usr/src/packages/BUILD=. -fstack-protector-strong -Wformat -Werror=format-security -Werror=implicit -Werror=maybe-uninitialized -Werror=memset-transposed-args -Wnull-dereference -Werror=sizeof-array-argument -Werror=sizeof-pointer-memaccess -c -o assignment_fsm.o assignment_fsm.c
[ 1122s] assignment_fsm.c:26:10: fatal error: osmocom/mgcp_client/mgcp_client_endpoint_fsm.h: No such file or directory
[ 1122s]  #include <osmocom/mgcp_client/mgcp_client_endpoint_fsm.h>
[ 1122s]           ^~~~~~~~~~~~~~~~~~~~~~~~~~~~~~~~~~~~~~~~~~~~~~~~
[ 1122s] compilation terminated.
[ 1122s] make[4]: *** [Makefile:662: assignment_fsm.o] Error 1
[ 1122s] make[4]: Leaving directory '/usr/src/packages/BUILD/src/osmo-bsc'
[ 1122s] make[3]: *** [Makefile:405: all-recursive] Error 1
[ 1122s] make[3]: Leaving directory '/usr/src/packages/BUILD/src'
[ 1122s] make[2]: *** [Makefile:448: all-recursive] Error 1
[ 1122s] make[2]: Leaving directory '/usr/src/packages/BUILD'
[ 1122s] make[1]: *** [Makefile:380: all] Error 2
[ 1122s] make[1]: Leaving directory '/usr/src/packages/BUILD'
[ 1122s] dh_auto_build: make -j1 returned exit code 2
[ 1122s] make: *** [debian/rules:45: build] Error 2
[ 1122s] dpkg-buildpackage: error: debian/rules build subprocess returned exit status 2
[ 1122s] 
[ 1122s] obs-arm-5 failed "build osmo-bsc_1.5.0.dsc" at Thu Aug  8 04:50:13 UTC 2019.
[ 1122s] 
[ 1122s] ### VM INTERACTION START ###
[ 1126s] [ 1041.278855] sysrq: SysRq : Power Off
[ 1126s] [ 1041.296921] reboot: Power down
[ 1127s] ### VM INTERACTION END ###
[ 1127s] 
[ 1127s] obs-arm-5 failed "build osmo-bsc_1.5.0.dsc" at Thu Aug  8 04:50:18 UTC 2019.
[ 1127s] 

Configure notifications at
openSUSE Build Service (

More information about the gerrit-log mailing list