Build failure of network:osmocom:latest/osmo-sgsn in Debian_Testing/x86_64

OBS Notification admin at opensuse.org
Thu Aug 8 04:08:59 UTC 2019


Visit https://build.opensuse.org/package/live_build_log/network:osmocom:latest/osmo-sgsn/Debian_Testing/x86_64

Package network:osmocom:latest/osmo-sgsn failed to build in Debian_Testing/x86_64

Check out the package for editing:
  osc checkout network:osmocom:latest osmo-sgsn

Last lines of build log:
[    8s] objdump: /boot/vmlinuz: warning: ignoring section flag IMAGE_SCN_MEM_NOT_PAGED in section .bss
[    8s] booting kvm...
[    8s] ### VM INTERACTION START ###
[    8s] /usr/bin/qemu-kvm -nodefaults -no-reboot -nographic -vga none -cpu host -object rng-random,filename=/dev/hwrng,id=rng0 -device virtio-rng-pci,rng=rng0 -runas qemu -net none -kernel /boot/vmlinuz -initrd /boot/initrd -append root=/dev/sda rootfstype=ext3 rootflags=data=writeback,nobarrier,commit=150,noatime ext4.allow_unsupported=1 kpti=off pti=off spectre_v2=off panic=1 quiet no-kvmclock elevator=noop nmi_watchdog=0 rw rd.driver.pre=binfmt_misc console=ttyS0 init=/.build/build -m 8192 -drive file=/var/cache/obs/worker/root_2/root,format=raw,if=none,id=disk,cache=unsafe -device ide-hd,drive=disk,serial=0 -drive file=/var/cache/obs/worker/root_2/swap,format=raw,if=none,id=swap,cache=unsafe -device ide-hd,drive=swap,serial=1 -serial stdio -chardev socket,id=monitor,server,nowait,path=/var/cache/obs/worker/root_2/root.qemu/monitor -mon chardev=monitor,mode=readline -smp 8
[    9s] c[?7lSeaBIOS (version rel-1.12.0-0-ga698c89-prebuilt.qemu.org)
[   12s] Booting from ROM..c[?7l### VM INTERACTION END ###
[   12s] 2nd stage started in virtual machine
[   12s] machine type: x86_64
[   12s] Linux version: 4[    2.996682] sysrq: SysRq : Changing Loglevel
[   12s] .12.14-lp151.28.[    2.998318] sysrq: Loglevel set to 4
[   12s] 10-default #1 SMP Sat Jul 13 17:59:31 UTC 2019 (0ab03b7)
[   12s] Increasing log level from now on...
[   12s] mount: error while loading shared libraries: libpcre2-8.so.0: cannot open shared object file: No such file or directory
[   12s] mkdir: error while loading shared libraries: libpcre2-8.so.0: cannot open shared object file: No such file or directory
[   12s] mkdir: error while loading shared libraries: libpcre2-8.so.0: cannot open shared object file: No such file or directory
[   12s] mount: error while loading shared libraries: libpcre2-8.so.0: cannot open shared object file: No such file or directory
[   12s] mount: error while loading shared libraries: libpcre2-8.so.0: cannot open shared object file: No such file or directory
[   12s] mkswap: error while loading shared libraries: libpcre2-8.so.0: cannot open shared object file: No such file or directory
[   12s] swapon: error while loading shared libraries: libpcre2-8.so.0: cannot open shared object file: No such file or directory
[   12s] 
[   12s]  failed "build osmo-sgsn_1.4.1.dsc" at Thu Aug  8 04:08:46 UTC 2019.
[   12s] 
[   12s] ### VM INTERACTION START ###
[   15s] [    6.062168] sysrq: SysRq : Power Off
[   15s] [    6.068801] reboot: Power down
[   16s] ### VM INTERACTION END ###
[   16s] 
[   16s] sheep84 failed "build osmo-sgsn_1.4.1.dsc" at Thu Aug  8 04:08:50 UTC 2019.
[   16s] 

-- 
Configure notifications at https://build.opensuse.org/user/notifications
openSUSE Build Service (https://build.opensuse.org/)


More information about the gerrit-log mailing list