Build failure of network:osmocom:latest/yder in Debian_Testing/x86_64

OBS Notification admin at opensuse.org
Thu Aug 8 04:08:07 UTC 2019


Visit https://build.opensuse.org/package/live_build_log/network:osmocom:latest/yder/Debian_Testing/x86_64

Package network:osmocom:latest/yder failed to build in Debian_Testing/x86_64

Check out the package for editing:
  osc checkout network:osmocom:latest yder

Last lines of build log:
[   16s] objdump: /boot/vmlinuz: warning: ignoring section flag IMAGE_SCN_MEM_NOT_PAGED in section .bss
[   25s] booting kvm...
[   25s] ### VM INTERACTION START ###
[   25s] /usr/bin/qemu-kvm -nodefaults -no-reboot -nographic -vga none -cpu host -object rng-random,filename=/dev/random,id=rng0 -device virtio-rng-pci,rng=rng0 -runas qemu -net none -kernel /boot/vmlinuz -initrd /boot/initrd -append root=/dev/sda rootfstype=ext3 rootflags=data=writeback,nobarrier,commit=150,noatime ext4.allow_unsupported=1 kpti=off pti=off spectre_v2=off panic=1 quiet no-kvmclock elevator=noop nmi_watchdog=0 rw rd.driver.pre=binfmt_misc console=ttyS0 init=/.build/build -m 3000 -drive file=/var/cache/obs/worker/root_1/root,format=raw,if=none,id=disk,cache=unsafe -device ide-hd,drive=disk,serial=0 -drive file=/var/cache/obs/worker/root_1/swap,format=raw,if=none,id=swap,cache=unsafe -device ide-hd,drive=swap,serial=1 -serial stdio -chardev socket,id=monitor,server,nowait,path=/var/cache/obs/worker/root_1/root.qemu/monitor -mon chardev=monitor,mode=readline -smp 4
[   26s] c[?7lSeaBIOS (version rel-1.12.0-0-ga698c89-prebuilt.qemu.org)
[   31s] Booting from ROM..c[?7l### VM INTERACTION END ###
[   31s] 2nd stage started in virtual machine
[   33s] machine type: x86_64
[   33s] Linux version: 4[    6.112886] sysrq: SysRq : Changing Loglevel
[   33s] [    6.114345] sysrq: Loglevel set to 4
[   33s] .12.14-lp151.28.10-default #1 SMP Sat Jul 13 17:59:31 UTC 2019 (0ab03b7)
[   33s] Increasing log level from now on...
[   33s] mount: error while loading shared libraries: libpcre2-8.so.0: cannot open shared object file: No such file or directory
[   33s] mkdir: error while loading shared libraries: libpcre2-8.so.0: cannot open shared object file: No such file or directory
[   33s] mkdir: error while loading shared libraries: libpcre2-8.so.0: cannot open shared object file: No such file or directory
[   33s] mount: error while loading shared libraries: libpcre2-8.so.0: cannot open shared object file: No such file or directory
[   33s] mount: error while loading shared libraries: libpcre2-8.so.0: cannot open shared object file: No such file or directory
[   33s] mkswap: error while loading shared libraries: libpcre2-8.so.0: cannot open shared object file: No such file or directory
[   33s] swapon: error while loading shared libraries: libpcre2-8.so.0: cannot open shared object file: No such file or directory
[   33s] 
[   33s]  failed "build yder_1.4.4-4.1.dsc" at Thu Aug  8 04:07:49 UTC 2019.
[   33s] 
[   33s] ### VM INTERACTION START ###
[   36s] [    9.444952] sysrq: SysRq : Power Off
[   36s] [    9.462300] reboot: Power down
[   36s] ### VM INTERACTION END ###
[   36s] 
[   36s] cloud113 failed "build yder_1.4.4-4.1.dsc" at Thu Aug  8 04:07:53 UTC 2019.
[   36s] 

-- 
Configure notifications at https://build.opensuse.org/user/notifications
openSUSE Build Service (https://build.opensuse.org/)


More information about the gerrit-log mailing list