Build failure of network:osmocom:latest/limesuite in Debian_Testing/x86_64

OBS Notification admin at opensuse.org
Thu Aug 8 04:07:33 UTC 2019


Visit https://build.opensuse.org/package/live_build_log/network:osmocom:latest/limesuite/Debian_Testing/x86_64

Package network:osmocom:latest/limesuite failed to build in Debian_Testing/x86_64

Check out the package for editing:
  osc checkout network:osmocom:latest limesuite

Last lines of build log:
[   26s] objdump: /boot/vmlinuz: warning: ignoring section flag IMAGE_SCN_MEM_NOT_PAGED in section .bss
[   37s] booting kvm...
[   37s] ### VM INTERACTION START ###
[   37s] /usr/bin/qemu-kvm -nodefaults -no-reboot -nographic -vga none -cpu host -object rng-random,filename=/dev/random,id=rng0 -device virtio-rng-pci,rng=rng0 -runas qemu -net none -kernel /boot/vmlinuz -initrd /boot/initrd -append root=/dev/sda rootfstype=ext3 rootflags=data=writeback,nobarrier,commit=150,noatime ext4.allow_unsupported=1 kpti=off pti=off spectre_v2=off panic=1 quiet no-kvmclock elevator=noop nmi_watchdog=0 rw rd.driver.pre=binfmt_misc console=ttyS0 init=/.build/build -m 3000 -drive file=/var/cache/obs/worker/root_1/root,format=raw,if=none,id=disk,cache=unsafe -device ide-hd,drive=disk,serial=0 -drive file=/var/cache/obs/worker/root_1/swap,format=raw,if=none,id=swap,cache=unsafe -device ide-hd,drive=swap,serial=1 -serial stdio -chardev socket,id=monitor,server,nowait,path=/var/cache/obs/worker/root_1/root.qemu/monitor -mon chardev=monitor,mode=readline -smp 4
[   38s] c[?7lSeaBIOS (version rel-1.12.0-0-ga698c89-prebuilt.qemu.org)
[   44s] Booting from ROM..c[?7l### VM INTERACTION END ###
[   44s] 2nd stage started in virtual machine
[   46s] machine type: x86_64
[   46s] [    7.036719] sysrq: SysRq : Changing Loglevel
[   46s] [    7.038121] sysrq: Loglevel set to 4
[   46s] Linux version: 4.12.14-lp151.28.10-default #1 SMP Sat Jul 13 17:59:31 UTC 2019 (0ab03b7)
[   46s] Increasing log level from now on...
[   46s] mount: error while loading shared libraries: libpcre2-8.so.0: cannot open shared object file: No such file or directory
[   46s] mkdir: error while loading shared libraries: libpcre2-8.so.0: cannot open shared object file: No such file or directory
[   46s] mkdir: error while loading shared libraries: libpcre2-8.so.0: cannot open shared object file: No such file or directory
[   46s] mount: error while loading shared libraries: libpcre2-8.so.0: cannot open shared object file: No such file or directory
[   46s] mount: error while loading shared libraries: libpcre2-8.so.0: cannot open shared object file: No such file or directory
[   46s] mkswap: error while loading shared libraries: libpcre2-8.so.0: cannot open shared object file: No such file or directory
[   46s] swapon: error while loading shared libraries: libpcre2-8.so.0: cannot open shared object file: No such file or directory
[   46s] 
[   46s]  failed "build limesuite_19.04.0-1.dsc" at Thu Aug  8 04:07:20 UTC 2019.
[   46s] 
[   46s] ### VM INTERACTION START ###
[   49s] [   10.434699] sysrq: SysRq : Power Off
[   49s] [   10.440516] reboot: Power down
[   50s] ### VM INTERACTION END ###
[   50s] 
[   50s] cloud123 failed "build limesuite_19.04.0-1.dsc" at Thu Aug  8 04:07:25 UTC 2019.
[   50s] 

-- 
Configure notifications at https://build.opensuse.org/user/notifications
openSUSE Build Service (https://build.opensuse.org/)


More information about the gerrit-log mailing list