Build failure of network:osmocom:nightly/osmo-fl2k in Debian_Testing/x86_64

OBS Notification admin at opensuse.org
Thu Aug 8 04:07:33 UTC 2019


Visit https://build.opensuse.org/package/live_build_log/network:osmocom:nightly/osmo-fl2k/Debian_Testing/x86_64

Package network:osmocom:nightly/osmo-fl2k failed to build in Debian_Testing/x86_64

Check out the package for editing:
  osc checkout network:osmocom:nightly osmo-fl2k

Last lines of build log:
[   43s] [  OK  ] Closed udev Control Socket.
[   43s]          Starting Cleanup udevd DB...
[   43s] [  OK  ] Started Cleanup udevd DB.
[   43s] [  OK  ] Reached target Switch Root.
[   43s]          Starting Switch Root...
[   45s] ### VM INTERACTION END ###
[   45s] 2nd stage started in virtual machine
[   46s] machine type: x86_64
[   46s] [   17.438859] sysrq: SysRq : Changing Loglevel
[   46s] [   17.440256] sysrq: Loglevel set to 4
[   46s] Linux version: 4.12.14-lp151.28.10-default #1 SMP Sat Jul 13 17:59:31 UTC 2019 (0ab03b7)
[   46s] Increasing log level from now on...
[   47s] mount: error while loading shared libraries: libpcre2-8.so.0: cannot open shared object file: No such file or directory
[   47s] mkdir: error while loading shared libraries: libpcre2-8.so.0: cannot open shared object file: No such file or directory
[   47s] mkdir: error while loading shared libraries: libpcre2-8.so.0: cannot open shared object file: No such file or directory
[   47s] mount: error while loading shared libraries: libpcre2-8.so.0: cannot open shared object file: No such file or directory
[   47s] mount: error while loading shared libraries: libpcre2-8.so.0: cannot open shared object file: No such file or directory
[   47s] mkswap: error while loading shared libraries: libpcre2-8.so.0: cannot open shared object file: No such file or directory
[   47s] swapon: error while loading shared libraries: libpcre2-8.so.0: cannot open shared object file: No such file or directory
[   47s] 
[   47s]  failed "build osmo-fl2k_0.1.1.13.fb20.dsc" at Thu Aug  8 04:07:19 UTC 2019.
[   47s] 
[   47s] ### VM INTERACTION START ###
[   50s] [   20.827498] sysrq: SysRq : Power Off
[   50s] [   20.870692] reboot: Power down
[   50s] ### VM INTERACTION END ###
[   50s] 
[   50s] cloud113 failed "build osmo-fl2k_0.1.1.13.fb20.dsc" at Thu Aug  8 04:07:23 UTC 2019.
[   50s] 

-- 
Configure notifications at https://build.opensuse.org/user/notifications
openSUSE Build Service (https://build.opensuse.org/)


More information about the gerrit-log mailing list