Build failure of network:osmocom:nightly/limesuite in Debian_Testing/x86_64

OBS Notification admin at opensuse.org
Thu Aug 8 04:06:41 UTC 2019


Visit https://build.opensuse.org/package/live_build_log/network:osmocom:nightly/limesuite/Debian_Testing/x86_64

Package network:osmocom:nightly/limesuite failed to build in Debian_Testing/x86_64

Check out the package for editing:
  osc checkout network:osmocom:nightly limesuite

Last lines of build log:
[    9s] objdump: /boot/vmlinuz: warning: ignoring section flag IMAGE_SCN_MEM_NOT_PAGED in section .bss
[   10s] booting kvm...
[   10s] ### VM INTERACTION START ###
[   10s] /usr/bin/qemu-kvm -nodefaults -no-reboot -nographic -vga none -cpu host -object rng-random,filename=/dev/hwrng,id=rng0 -device virtio-rng-pci,rng=rng0 -runas qemu -net none -kernel /boot/vmlinuz -initrd /boot/initrd -append root=/dev/sda rootfstype=ext3 rootflags=data=writeback,nobarrier,commit=150,noatime ext4.allow_unsupported=1 kpti=off pti=off spectre_v2=off panic=1 quiet no-kvmclock elevator=noop nmi_watchdog=0 rw rd.driver.pre=binfmt_misc console=ttyS0 init=/.build/build -m 8192 -drive file=/var/cache/obs/worker/root_8/root,format=raw,if=none,id=disk,cache=unsafe -device ide-hd,drive=disk,serial=0 -drive file=/var/cache/obs/worker/root_8/swap,format=raw,if=none,id=swap,cache=unsafe -device ide-hd,drive=swap,serial=1 -serial stdio -chardev socket,id=monitor,server,nowait,path=/var/cache/obs/worker/root_8/root.qemu/monitor -mon chardev=monitor,mode=readline -smp 8
[   11s] c[?7lSeaBIOS (version rel-1.12.0-0-ga698c89-prebuilt.qemu.org)
[   14s] Booting from ROM..c[?7l### VM INTERACTION END ###
[   14s] 2nd stage started in virtual machine
[   14s] machine type: x86_64
[   14s] Linux version: 4.12.14-lp151.28.10-default #1 SMP Sat Jul 13 17:59:31 UTC 2019 (0ab03b7)
[   14s] Increasing log level from now on...
[   14s] [    2.961156] sysrq: SysRq : Changing Loglevel
[   14s] [    2.962179] sysrq: Loglevel set to 4
[   14s] mount: error while loading shared libraries: libpcre2-8.so.0: cannot open shared object file: No such file or directory
[   14s] mkdir: error while loading shared libraries: libpcre2-8.so.0: cannot open shared object file: No such file or directory
[   14s] mkdir: error while loading shared libraries: libpcre2-8.so.0: cannot open shared object file: No such file or directory
[   14s] mount: error while loading shared libraries: libpcre2-8.so.0: cannot open shared object file: No such file or directory
[   14s] mount: error while loading shared libraries: libpcre2-8.so.0: cannot open shared object file: No such file or directory
[   14s] mkswap: error while loading shared libraries: libpcre2-8.so.0: cannot open shared object file: No such file or directory
[   14s] swapon: error while loading shared libraries: libpcre2-8.so.0: cannot open shared object file: No such file or directory
[   14s] 
[   14s]  failed "build limesuite_19.04.0-1.dsc" at Thu Aug  8 04:06:32 UTC 2019.
[   14s] 
[   14s] ### VM INTERACTION START ###
[   17s] [    6.016505] sysrq: SysRq : Power Off
[   17s] [    6.022754] reboot: Power down
[   17s] ### VM INTERACTION END ###
[   17s] 
[   17s] sheep83 failed "build limesuite_19.04.0-1.dsc" at Thu Aug  8 04:06:36 UTC 2019.
[   17s] 

-- 
Configure notifications at https://build.opensuse.org/user/notifications
openSUSE Build Service (https://build.opensuse.org/)


More information about the gerrit-log mailing list