Build failure of network:osmocom:latest/osmo-bsc in xUbuntu_18.10/i586

OBS Notification admin at
Thu Aug 8 02:26:07 UTC 2019


Package network:osmocom:latest/osmo-bsc failed to build in xUbuntu_18.10/i586

Check out the package for editing:
  osc checkout network:osmocom:latest osmo-bsc

Last lines of build log:
[  538s] gcc -DHAVE_CONFIG_H -I. -I../..   -I../../include -I../..  -Wdate-time -D_FORTIFY_SOURCE=2 -Wall -I/usr/include/ -I/usr/include/ -I/usr/include/ -I/usr/include/ -I/usr/include/  -I/usr/include/ -I/usr/include/ -I/usr/include/  -g -O2 -fdebug-prefix-map=/usr/src/packages/BUILD=. -fstack-protector-strong -Wformat -Werror=format-security -Werror=implicit -Werror=maybe-uninitialized -Werror=memset-transposed-args -Wnull-dereference -Werror=sizeof-array-argument -Werror=sizeof-pointer-memaccess -c -o abis_rsl.o abis_rsl.c
[  541s] gcc -DHAVE_CONFIG_H -I. -I../..   -I../../include -I../..  -Wdate-time -D_FORTIFY_SOURCE=2 -Wall -I/usr/include/ -I/usr/include/ -I/usr/include/ -I/usr/include/ -I/usr/include/  -I/usr/include/ -I/usr/include/ -I/usr/include/  -g -O2 -fdebug-prefix-map=/usr/src/packages/BUILD=. -fstack-protector-strong -Wformat -Werror=format-security -Werror=implicit -Werror=maybe-uninitialized -Werror=memset-transposed-args -Wnull-dereference -Werror=sizeof-array-argument -Werror=sizeof-pointer-memaccess -c -o acc_ramp.o acc_ramp.c
[  541s] gcc -DHAVE_CONFIG_H -I. -I../..   -I../../include -I../..  -Wdate-time -D_FORTIFY_SOURCE=2 -Wall -I/usr/include/ -I/usr/include/ -I/usr/include/ -I/usr/include/ -I/usr/include/  -I/usr/include/ -I/usr/include/ -I/usr/include/  -g -O2 -fdebug-prefix-map=/usr/src/packages/BUILD=. -fstack-protector-strong -Wformat -Werror=format-security -Werror=implicit -Werror=maybe-uninitialized -Werror=memset-transposed-args -Wnull-dereference -Werror=sizeof-array-argument -Werror=sizeof-pointer-memaccess -c -o arfcn_range_encode.o arfcn_range_encode.c
[  541s] gcc -DHAVE_CONFIG_H -I. -I../..   -I../../include -I../..  -Wdate-time -D_FORTIFY_SOURCE=2 -Wall -I/usr/include/ -I/usr/include/ -I/usr/include/ -I/usr/include/ -I/usr/include/  -I/usr/include/ -I/usr/include/ -I/usr/include/  -g -O2 -fdebug-prefix-map=/usr/src/packages/BUILD=. -fstack-protector-strong -Wformat -Werror=format-security -Werror=implicit -Werror=maybe-uninitialized -Werror=memset-transposed-args -Wnull-dereference -Werror=sizeof-array-argument -Werror=sizeof-pointer-memaccess -c -o assignment_fsm.o assignment_fsm.c
[  541s] assignment_fsm.c:26:10: fatal error: osmocom/mgcp_client/mgcp_client_endpoint_fsm.h: No such file or directory
[  541s]  #include <osmocom/mgcp_client/mgcp_client_endpoint_fsm.h>
[  541s]           ^~~~~~~~~~~~~~~~~~~~~~~~~~~~~~~~~~~~~~~~~~~~~~~~
[  541s] compilation terminated.
[  541s] make[4]: *** [Makefile:662: assignment_fsm.o] Error 1
[  541s] make[4]: Leaving directory '/usr/src/packages/BUILD/src/osmo-bsc'
[  541s] make[3]: *** [Makefile:405: all-recursive] Error 1
[  541s] make[3]: Leaving directory '/usr/src/packages/BUILD/src'
[  541s] make[2]: *** [Makefile:448: all-recursive] Error 1
[  541s] make[2]: Leaving directory '/usr/src/packages/BUILD'
[  541s] make[1]: *** [Makefile:380: all] Error 2
[  541s] make[1]: Leaving directory '/usr/src/packages/BUILD'
[  541s] dh_auto_build: make -j1 returned exit code 2
[  541s] make: *** [debian/rules:45: build] Error 2
[  541s] dpkg-buildpackage: error: debian/rules build subprocess returned exit status 2
[  541s] 
[  541s] build76 failed "build osmo-bsc_1.5.0.dsc" at Thu Aug  8 02:25:51 UTC 2019.
[  541s] 
[  541s] ### VM INTERACTION START ###
[  545s] [  529.250441] sysrq: SysRq : Power Off
[  545s] [  529.257039] reboot: Power down
[  545s] ### VM INTERACTION END ###
[  545s] 
[  545s] build76 failed "build osmo-bsc_1.5.0.dsc" at Thu Aug  8 02:25:55 UTC 2019.
[  545s] 

Configure notifications at
openSUSE Build Service (

More information about the gerrit-log mailing list