Build failure of network:osmocom:latest/osmo-bsc in xUbuntu_19.04/x86_64

OBS Notification admin at
Thu Aug 8 02:21:50 UTC 2019


Package network:osmocom:latest/osmo-bsc failed to build in xUbuntu_19.04/x86_64

Check out the package for editing:
  osc checkout network:osmocom:latest osmo-bsc

Last lines of build log:
[  275s] gcc -DHAVE_CONFIG_H -I. -I../..   -I../../include -I../..  -Wdate-time -D_FORTIFY_SOURCE=2 -Wall -I/usr/include/ -I/usr/include/ -I/usr/include/ -I/usr/include/ -I/usr/include/  -I/usr/include/ -I/usr/include/ -I/usr/include/  -g -O2 -fdebug-prefix-map=/usr/src/packages/BUILD=. -fstack-protector-strong -Wformat -Werror=format-security -Werror=implicit -Werror=maybe-uninitialized -Werror=memset-transposed-args -Wnull-dereference -Werror=sizeof-array-argument -Werror=sizeof-pointer-memaccess -c -o abis_rsl.o abis_rsl.c
[  277s] gcc -DHAVE_CONFIG_H -I. -I../..   -I../../include -I../..  -Wdate-time -D_FORTIFY_SOURCE=2 -Wall -I/usr/include/ -I/usr/include/ -I/usr/include/ -I/usr/include/ -I/usr/include/  -I/usr/include/ -I/usr/include/ -I/usr/include/  -g -O2 -fdebug-prefix-map=/usr/src/packages/BUILD=. -fstack-protector-strong -Wformat -Werror=format-security -Werror=implicit -Werror=maybe-uninitialized -Werror=memset-transposed-args -Wnull-dereference -Werror=sizeof-array-argument -Werror=sizeof-pointer-memaccess -c -o acc_ramp.o acc_ramp.c
[  277s] gcc -DHAVE_CONFIG_H -I. -I../..   -I../../include -I../..  -Wdate-time -D_FORTIFY_SOURCE=2 -Wall -I/usr/include/ -I/usr/include/ -I/usr/include/ -I/usr/include/ -I/usr/include/  -I/usr/include/ -I/usr/include/ -I/usr/include/  -g -O2 -fdebug-prefix-map=/usr/src/packages/BUILD=. -fstack-protector-strong -Wformat -Werror=format-security -Werror=implicit -Werror=maybe-uninitialized -Werror=memset-transposed-args -Wnull-dereference -Werror=sizeof-array-argument -Werror=sizeof-pointer-memaccess -c -o arfcn_range_encode.o arfcn_range_encode.c
[  277s] gcc -DHAVE_CONFIG_H -I. -I../..   -I../../include -I../..  -Wdate-time -D_FORTIFY_SOURCE=2 -Wall -I/usr/include/ -I/usr/include/ -I/usr/include/ -I/usr/include/ -I/usr/include/  -I/usr/include/ -I/usr/include/ -I/usr/include/  -g -O2 -fdebug-prefix-map=/usr/src/packages/BUILD=. -fstack-protector-strong -Wformat -Werror=format-security -Werror=implicit -Werror=maybe-uninitialized -Werror=memset-transposed-args -Wnull-dereference -Werror=sizeof-array-argument -Werror=sizeof-pointer-memaccess -c -o assignment_fsm.o assignment_fsm.c
[  277s] assignment_fsm.c:26:10: fatal error: osmocom/mgcp_client/mgcp_client_endpoint_fsm.h: No such file or directory
[  277s]  #include <osmocom/mgcp_client/mgcp_client_endpoint_fsm.h>
[  277s]           ^~~~~~~~~~~~~~~~~~~~~~~~~~~~~~~~~~~~~~~~~~~~~~~~
[  277s] compilation terminated.
[  277s] make[4]: *** [Makefile:662: assignment_fsm.o] Error 1
[  277s] make[4]: Leaving directory '/usr/src/packages/BUILD/src/osmo-bsc'
[  277s] make[3]: *** [Makefile:405: all-recursive] Error 1
[  277s] make[3]: Leaving directory '/usr/src/packages/BUILD/src'
[  277s] make[2]: *** [Makefile:448: all-recursive] Error 1
[  277s] make[2]: Leaving directory '/usr/src/packages/BUILD'
[  277s] make[1]: *** [Makefile:380: all] Error 2
[  277s] make[1]: Leaving directory '/usr/src/packages/BUILD'
[  277s] dh_auto_build: make -j1 returned exit code 2
[  277s] make: *** [debian/rules:45: build] Error 2
[  277s] dpkg-buildpackage: error: debian/rules build subprocess returned exit status 2
[  277s] 
[  277s] build83 failed "build osmo-bsc_1.5.0.dsc" at Thu Aug  8 02:21:29 UTC 2019.
[  277s] 
[  277s] ### VM INTERACTION START ###
[  280s] [  270.630965] sysrq: SysRq : Power Off
[  280s] [  270.638575] reboot: Power down
[  280s] ### VM INTERACTION END ###
[  280s] 
[  280s] build83 failed "build osmo-bsc_1.5.0.dsc" at Thu Aug  8 02:21:33 UTC 2019.
[  280s] 

Configure notifications at
openSUSE Build Service (

More information about the gerrit-log mailing list