Build failure of network:osmocom:latest/osmo-mgw in xUbuntu_19.04/x86_64

OBS Notification admin at opensuse.org
Thu Aug 8 02:16:24 UTC 2019


Visit https://build.opensuse.org/package/live_build_log/network:osmocom:latest/osmo-mgw/xUbuntu_19.04/x86_64

Package network:osmocom:latest/osmo-mgw failed to build in xUbuntu_19.04/x86_64

Check out the package for editing:
  osc checkout network:osmocom:latest osmo-mgw

Last lines of build log:
[  347s] asciidoc -v -f /usr/share/osmo-gsm-manuals/build/mscgen-filter.conf -f /usr/share/osmo-gsm-manuals/build/diag-filter.conf -f /usr/share/osmo-gsm-manuals/build/docinfo-releaseinfo.conf -f /usr/share/osmo-gsm-manuals/build/python2-filter.conf -a srcdir='.' osmomgw-usermanual.adoc > osmomgw-usermanual.check 2>&1
[  352s] # Make absolutely sure that the %.check target is updated.
[  352s] touch osmomgw-usermanual.check
[  352s] # Do print the WARNING output but return error if any was found
[  352s] # (grep -v would omit the WARNING output from the log).
[  352s] asciidoc: WARNING: osmomgw-usermanual.adoc: line 23: include file not found: /usr/src/packages/BUILD/doc/manuals/common/chapters/osmux/osmux.adoc
[  352s] make[5]: *** [/usr/share/osmo-gsm-manuals/build/Makefile.asciidoc.inc:95: osmomgw-usermanual.check] Error 1
[  352s] make[5]: Leaving directory '/usr/src/packages/BUILD/doc/manuals'
[  352s] make[4]: *** [Makefile:380: check-recursive] Error 1
[  352s] make[4]: Leaving directory '/usr/src/packages/BUILD/doc'
[  352s] make[3]: *** [Makefile:499: check-recursive] Error 1
[  352s] make[3]: Leaving directory '/usr/src/packages/BUILD'
[  352s] make[2]: *** [Makefile:793: check] Error 2
[  352s] make[2]: Leaving directory '/usr/src/packages/BUILD'
[  352s] dh_auto_test: make -j1 check VERBOSE=1 returned exit code 2
[  352s] make[1]: *** [debian/rules:30: override_dh_auto_test] Error 1
[  352s] make[1]: Leaving directory '/usr/src/packages/BUILD'
[  352s] make: *** [debian/rules:17: build] Error 2
[  352s] dpkg-buildpackage: error: debian/rules build subprocess returned exit status 2
[  352s] 
[  352s] build36 failed "build osmo-mgw_1.6.0.dsc" at Thu Aug  8 02:16:08 UTC 2019.
[  352s] 
[  352s] ### VM INTERACTION START ###
[  355s] [  336.065363] sysrq: SysRq : Power Off
[  355s] [  336.106145] reboot: Power down
[  356s] ### VM INTERACTION END ###
[  356s] 
[  356s] build36 failed "build osmo-mgw_1.6.0.dsc" at Thu Aug  8 02:16:12 UTC 2019.
[  356s] 

-- 
Configure notifications at https://build.opensuse.org/user/notifications
openSUSE Build Service (https://build.opensuse.org/)


More information about the gerrit-log mailing list