Build failure of network:osmocom:latest/libosmo-netif in Raspbian_9.0/armv7l

OBS Notification admin at opensuse.org
Wed Aug 7 03:00:03 UTC 2019


Visit https://build.opensuse.org/package/live_build_log/network:osmocom:latest/libosmo-netif/Raspbian_9.0/armv7l

Package network:osmocom:latest/libosmo-netif failed to build in Raspbian_9.0/armv7l

Check out the package for editing:
  osc checkout network:osmocom:latest libosmo-netif

Last lines of build log:
[  684s] | #define HAVE_DLFCN_H 1
[  684s] | #define LT_OBJDIR ".libs/"
[  684s] | #define STDC_HEADERS 1
[  684s] | #define HAVE_EXECINFO_H 1
[  684s] | #define HAVE_SYS_SELECT_H 1
[  684s] | #define HAVE_SYS_SOCKET_H 1
[  684s] | #define HAVE_SYSLOG_H 1
[  684s] | #define HAVE_CTYPE_H 1
[  684s] | #define HAVE_LIBSCTP 1
[  684s] | #define HAVE_PCAP_H 1
[  684s] | 
[  684s] | configure: exit 0
[  684s] 
[  684s] debian/rules:27: recipe for target 'override_dh_auto_test' failed
[  684s] make[1]: *** [override_dh_auto_test] Error 1
[  684s] make[1]: Leaving directory '/usr/src/packages/BUILD'
[  684s] debian/rules:13: recipe for target 'build' failed
[  684s] make: *** [build] Error 2
[  684s] dpkg-buildpackage: error: debian/rules build gave error exit status 2
[  684s] 
[  684s] obs-arm-5 failed "build libosmo-netif_0.5.0.dsc" at Wed Aug  7 02:59:52 UTC 2019.
[  684s] 
[  684s] ### VM INTERACTION START ###
[  687s] [  649.826123] sysrq: SysRq : Power Off
[  687s] [  649.940201] reboot: Power down
[  688s] ### VM INTERACTION END ###
[  688s] 
[  688s] obs-arm-5 failed "build libosmo-netif_0.5.0.dsc" at Wed Aug  7 02:59:56 UTC 2019.
[  688s] 

-- 
Configure notifications at https://build.opensuse.org/user/notifications
openSUSE Build Service (https://build.opensuse.org/)


More information about the gerrit-log mailing list