Build failure of network:osmocom:nightly/osmo-gsm-manuals in Debian_10/i586

OBS Notification admin at opensuse.org
Thu Aug 1 01:41:19 UTC 2019


Visit https://build.opensuse.org/package/live_build_log/network:osmocom:nightly/osmo-gsm-manuals/Debian_10/i586

Package network:osmocom:nightly/osmo-gsm-manuals failed to build in Debian_10/i586

Check out the package for editing:
  osc checkout network:osmocom:nightly osmo-gsm-manuals

Last lines of build log:
[  486s] # same.
[  486s] if ! [ -f test-usermanual.adoc ]; then \
[  486s] 	ln -s test-usermanual.adoc test-usermanual.adoc; \
[  486s] fi
[  486s] asciidoc -v -f ../build/mscgen-filter.conf -f ../build/diag-filter.conf -f ../build/docinfo-releaseinfo.conf -f ../build/python2-filter.conf -a srcdir='.' -a commondir='../common' test-usermanual.adoc > test-usermanual.check 2>&1
[  523s] # Make absolutely sure that the %.check target is updated.
[  523s] touch test-usermanual.check
[  523s] # Do print the WARNING output but return error if any was found
[  523s] # (grep -v would omit the WARNING output from the log).
[  523s] asciidoc: WARNING: mgcp_extension_osmux.adoc: line 2: section title out of sequence: expected level 1, got level 2
[  523s] make[3]: *** [../build/Makefile.asciidoc.inc:96: test-usermanual.check] Error 1
[  523s] make[3]: Leaving directory '/usr/src/packages/BUILD/tests'
[  523s] make[2]: *** [Makefile:438: check-recursive] Error 1
[  523s] make[2]: Leaving directory '/usr/src/packages/BUILD'
[  523s] make[1]: *** [Makefile:732: check] Error 2
[  523s] make[1]: Leaving directory '/usr/src/packages/BUILD'
[  523s] dh_auto_test: make -j1 check VERBOSE=1 returned exit code 2
[  523s] make: *** [debian/rules:5: binary] Error 2
[  523s] dpkg-buildpackage: error: fakeroot debian/rules binary subprocess returned exit status 2
[  523s] 
[  523s] lamb10 failed "build osmo-gsm-manuals-dev_0.1.1.7.35ca.dsc" at Thu Aug  1 01:41:14 UTC 2019.
[  523s] 
[  523s] ### VM INTERACTION START ###
[  526s] [  506.406471] sysrq: SysRq : Power Off
[  526s] [  506.426686] reboot: Power down
[  526s] ### VM INTERACTION END ###
[  526s] 
[  526s] lamb10 failed "build osmo-gsm-manuals-dev_0.1.1.7.35ca.dsc" at Thu Aug  1 01:41:17 UTC 2019.
[  526s] 

-- 
Configure notifications at https://build.opensuse.org/user/notifications
openSUSE Build Service (https://build.opensuse.org/)


More information about the gerrit-log mailing list