Build failure of network:osmocom:nightly/osmo-gsm-manuals in Debian_9.0/i586

OBS Notification admin at opensuse.org
Thu Aug 1 01:38:12 UTC 2019


Visit https://build.opensuse.org/package/live_build_log/network:osmocom:nightly/osmo-gsm-manuals/Debian_9.0/i586

Package network:osmocom:nightly/osmo-gsm-manuals failed to build in Debian_9.0/i586

Check out the package for editing:
  osc checkout network:osmocom:nightly osmo-gsm-manuals

Last lines of build log:
[  315s] asciidoc -v -f ../build/mscgen-filter.conf -f ../build/diag-filter.conf -f ../build/docinfo-releaseinfo.conf -f ../build/python2-filter.conf -a srcdir='.' -a commondir='../common' test-usermanual.adoc > test-usermanual.check 2>&1
[  353s] # Make absolutely sure that the %.check target is updated.
[  353s] touch test-usermanual.check
[  353s] # Do print the WARNING output but return error if any was found
[  353s] # (grep -v would omit the WARNING output from the log).
[  353s] asciidoc: WARNING: mgcp_extension_osmux.adoc: line 2: section title out of sequence: expected level 1, got level 2
[  353s] ../build/Makefile.asciidoc.inc:87: recipe for target 'test-usermanual.check' failed
[  353s] make[3]: *** [test-usermanual.check] Error 1
[  353s] make[3]: Leaving directory '/usr/src/packages/BUILD/tests'
[  353s] Makefile:438: recipe for target 'check-recursive' failed
[  353s] make[2]: *** [check-recursive] Error 1
[  353s] make[2]: Leaving directory '/usr/src/packages/BUILD'
[  353s] Makefile:729: recipe for target 'check' failed
[  353s] make[1]: *** [check] Error 2
[  353s] make[1]: Leaving directory '/usr/src/packages/BUILD'
[  353s] dh_auto_test: make -j1 check VERBOSE=1 returned exit code 2
[  353s] debian/rules:5: recipe for target 'binary' failed
[  353s] make: *** [binary] Error 2
[  353s] dpkg-buildpackage: error: fakeroot debian/rules binary gave error exit status 2
[  353s] 
[  353s] morla3 failed "build osmo-gsm-manuals-dev_0.1.1.7.35ca.dsc" at Thu Aug  1 01:37:57 UTC 2019.
[  353s] 
[  353s] ### VM INTERACTION START ###
[  356s] [  338.605220] sysrq: SysRq : Power Off
[  356s] [  338.628521] reboot: Power down
[  356s] ### VM INTERACTION END ###
[  356s] 
[  356s] morla3 failed "build osmo-gsm-manuals-dev_0.1.1.7.35ca.dsc" at Thu Aug  1 01:38:01 UTC 2019.
[  356s] 

-- 
Configure notifications at https://build.opensuse.org/user/notifications
openSUSE Build Service (https://build.opensuse.org/)


More information about the gerrit-log mailing list