Build failure of network:osmocom:nightly/libosmo-netif in xUbuntu_18.04/x86_64

OBS Notification admin at opensuse.org
Fri Apr 26 20:05:31 UTC 2019


Visit https://build.opensuse.org/package/live_build_log/network:osmocom:nightly/libosmo-netif/xUbuntu_18.04/x86_64

Package network:osmocom:nightly/libosmo-netif failed to build in xUbuntu_18.04/x86_64

Check out the package for editing:
  osc checkout network:osmocom:nightly libosmo-netif

Last lines of build log:
[  110s] +non-reconnecting test step 0 [client OK, server OK], FD reg 1
[  110s] --- expout	2019-04-26 20:05:14.332000000 +0000
[  110s] +++ /usr/src/packages/BUILD/tests/testsuite.dir/at-groups/1/stdout	2019-04-26 20:05:23.352000000 +0000
[  110s] @@ -44,8 +44,6 @@
[  110s]  [OK|OK] Server's read_cb_srv(): received 29(29) bytes: 44 6f 68 2c 20 72 65 73 70 6f 6e 64 69 6e 67 20 74 6f 20 73 65 72 76 65 72 20 3a 2d 44 
[  110s]  [OK|OK] Server's read_cb_srv(): sent 11 bytes message: 72 65 61 64 5f 63 62 5f 73 72 76 
[  110s]  [OK|OK] Server's read_cb_srv(): force client disconnect on subsequent call
[  110s] -[OK] Client's read_cb_cli(): callback triggered
[  110s] -[OK] Client's read_cb_cli(): 0-byte read, auto-reconnect will be triggered if enabled
[  110s]  non-reconnecting test complete.
[  110s]  
[  110s]  Stream tests completed
[  110s] 1. testsuite.at:4: 1. stream_test (testsuite.at:4): FAILED (testsuite.at:8)
[  110s] debian/rules:27: recipe for target 'override_dh_auto_test' failed
[  110s] make[1]: *** [override_dh_auto_test] Error 1
[  110s] make[1]: Leaving directory '/usr/src/packages/BUILD'
[  110s] debian/rules:13: recipe for target 'build' failed
[  110s] make: *** [build] Error 2
[  110s] dpkg-buildpackage: error: debian/rules build subprocess returned exit status 2
[  110s] 
[  110s] sheep82 failed "build libosmo-netif_0.4.0.25.e380.dsc" at Fri Apr 26 20:05:24 UTC 2019.
[  110s] 
[  110s] ### VM INTERACTION START ###
[  113s] [  105.254600] sysrq: SysRq : Power Off
[  113s] [  105.261337] reboot: Power down
[  113s] ### VM INTERACTION END ###
[  113s] 
[  113s] sheep82 failed "build libosmo-netif_0.4.0.25.e380.dsc" at Fri Apr 26 20:05:28 UTC 2019.
[  113s] 

-- 
Configure notifications at https://build.opensuse.org/user/notifications
openSUSE Build Service (https://build.opensuse.org/)


More information about the gerrit-log mailing list