Build failure of network:osmocom:nightly/libosmo-netif in Debian_9.0/x86_64

OBS Notification admin at opensuse.org
Sun Apr 14 20:05:30 UTC 2019


Visit https://build.opensuse.org/package/live_build_log/network:osmocom:nightly/libosmo-netif/Debian_9.0/x86_64

Package network:osmocom:nightly/libosmo-netif failed to build in Debian_9.0/x86_64

Check out the package for editing:
  osc checkout network:osmocom:nightly libosmo-netif

Last lines of build log:
[  159s]  autoreconnecting test step 3 [client OK, server OK], FD reg 1
[  159s]  
[  159s]  autoreconnecting test step 2 [client OK, server OK], FD reg 0
[  159s] +
[  159s] +autoreconnecting test step 1 [client OK, server OK], FD reg 0
[  159s]  connection closed with srv
[  159s]  
[  159s] -autoreconnecting test step 1 [client OK, server NA], FD reg 0
[  159s] +autoreconnecting test step 0 [client OK, server NA], FD reg 0
[  159s]  
[  159s]  non-reconnecting test step 7 [client NA, server OK], FD reg 1
[  159s]  
[  159s] 1. testsuite.at:4: 1. stream_test (testsuite.at:4): FAILED (testsuite.at:8)
[  159s] debian/rules:27: recipe for target 'override_dh_auto_test' failed
[  159s] make[1]: *** [override_dh_auto_test] Error 1
[  159s] make[1]: Leaving directory '/usr/src/packages/BUILD'
[  159s] debian/rules:13: recipe for target 'build' failed
[  159s] make: *** [build] Error 2
[  159s] dpkg-buildpackage: error: debian/rules build gave error exit status 2
[  159s] 
[  159s] lamb13 failed "build libosmo-netif_0.4.0.25.e380.dsc" at Sun Apr 14 20:05:23 UTC 2019.
[  159s] 
[  159s] ### VM INTERACTION START ###
[  162s] [  148.348931] sysrq: SysRq : Power Off
[  162s] [  148.361404] reboot: Power down
[  162s] ### VM INTERACTION END ###
[  162s] 
[  162s] lamb13 failed "build libosmo-netif_0.4.0.25.e380.dsc" at Sun Apr 14 20:05:27 UTC 2019.
[  162s] 

-- 
Configure notifications at https://build.opensuse.org/user/notifications
openSUSE Build Service (https://build.opensuse.org/)


More information about the gerrit-log mailing list