Build failure of network:osmocom:nightly/libosmo-netif in xUbuntu_17.10/x86_64

OBS Notification admin at opensuse.org
Fri Apr 12 02:51:19 UTC 2019


Visit https://build.opensuse.org/package/live_build_log/network:osmocom:nightly/libosmo-netif/xUbuntu_17.10/x86_64

Package network:osmocom:nightly/libosmo-netif failed to build in xUbuntu_17.10/x86_64

Check out the package for editing:
  osc checkout network:osmocom:nightly libosmo-netif

Last lines of build log:
[  115s] +non-reconnecting test step 0 [client OK, server OK], FD reg 1
[  115s] --- expout	2019-04-12 02:50:55.776000000 +0000
[  115s] +++ /usr/src/packages/BUILD/tests/testsuite.dir/at-groups/1/stdout	2019-04-12 02:51:04.796000000 +0000
[  115s] @@ -44,8 +44,6 @@
[  115s]  [OK|OK] Server's read_cb_srv(): received 29(29) bytes: 44 6f 68 2c 20 72 65 73 70 6f 6e 64 69 6e 67 20 74 6f 20 73 65 72 76 65 72 20 3a 2d 44 
[  115s]  [OK|OK] Server's read_cb_srv(): sent 11 bytes message: 72 65 61 64 5f 63 62 5f 73 72 76 
[  115s]  [OK|OK] Server's read_cb_srv(): force client disconnect on subsequent call
[  115s] -[OK] Client's read_cb_cli(): callback triggered
[  115s] -[OK] Client's read_cb_cli(): 0-byte read, auto-reconnect will be triggered if enabled
[  115s]  non-reconnecting test complete.
[  115s]  
[  115s]  Stream tests completed
[  115s] 1. testsuite.at:4: 1. stream_test (testsuite.at:4): FAILED (testsuite.at:8)
[  115s] debian/rules:27: recipe for target 'override_dh_auto_test' failed
[  115s] make[1]: *** [override_dh_auto_test] Error 1
[  115s] make[1]: Leaving directory '/usr/src/packages/BUILD'
[  115s] debian/rules:13: recipe for target 'build' failed
[  115s] make: *** [build] Error 2
[  115s] dpkg-buildpackage: error: debian/rules build gave error exit status 2
[  115s] 
[  115s] lamb01 failed "build libosmo-netif_0.4.0.25.e380.dsc" at Fri Apr 12 02:51:06 UTC 2019.
[  115s] 
[  115s] ### VM INTERACTION START ###
[  118s] [  107.016730] sysrq: SysRq : Power Off
[  118s] [  107.023688] reboot: Power down
[  118s] ### VM INTERACTION END ###
[  118s] 
[  118s] lamb01 failed "build libosmo-netif_0.4.0.25.e380.dsc" at Fri Apr 12 02:51:09 UTC 2019.
[  118s] 

-- 
Configure notifications at https://build.opensuse.org/user/notifications
openSUSE Build Service (https://build.opensuse.org/)


More information about the gerrit-log mailing list