Build failed in Jenkins: master-osmo-iuh » a1=default,a2=default,a3=default,osmocom-master-debian9 #2391

jenkins at lists.osmocom.org jenkins at lists.osmocom.org
Wed Nov 7 00:09:35 UTC 2018


See <https://jenkins.osmocom.org/jenkins/job/master-osmo-iuh/a1=default,a2=default,a3=default,label=osmocom-master-debian9/2391/display/redirect>

------------------------------------------
[...truncated 677.98 KB...]
  CC       HNBRegisterAccept.o
  CC       HNBRegisterReject.o
  CC       UERegisterRequest.o
  CC       UERegisterAccept.o
  CC       UERegisterReject.o
  CC       UEDe-Register.o
  CC       HNBDe-Register.o
  CC       ErrorIndication.o
  CC       CSGMembershipUpdate.o
  CC       TNLUpdateRequest.o
  CC       TNLUpdateResponse.o
  CC       TNLUpdateFailure.o
  CC       HNBConfigTransferRequest.o
  CC       HNBConfigTransferResponse.o
  CC       RelocationComplete.o
  CC       U-RNTIQueryRequest.o
  CC       U-RNTIQueryResponse.o
  CC       PrivateMessage.o
  CC       IE.o
  AR       libosmo-asn1-hnbap.a
ar: `u' modifier ignored since `D' is the default (see `U')
make[4]: Leaving directory '<https://jenkins.osmocom.org/jenkins/job/master-osmo-iuh/a1=default,a2=default,a3=default,label=osmocom-master-debian9/ws/src/hnbap'>
Making all in rua
make[4]: Entering directory '<https://jenkins.osmocom.org/jenkins/job/master-osmo-iuh/a1=default,a2=default,a3=default,label=osmocom-master-debian9/ws/src/rua'>
  CC       RUA_Presence.o
  CC       RUA_Criticality.o
  CC       RUA_ProcedureCode.o
  CC       RUA_ProtocolIE-ID.o
  CC       RUA_PrivateIE-ID.o
  CC       RUA_TriggeringMessage.o
  CC       RUA_IE-Extensions.o
  CC       RUA_CN-DomainIndicator.o
  CC       RUA_CSGMembershipStatus.o
  CC       RUA_Establishment-Cause.o
  CC       RUA_Context-ID.o
  CC       RUA_IntraDomainNasNodeSelector.o
  CC       RUA_Gsm-map-IDNNS.o
  CC       RUA_Ansi-41-IDNNS.o
  CC       RUA_RANAP-Message.o
  CC       RUA_RoutingParameter.o
  CC       RUA_Cause.o
  CC       RUA_CauseRadioNetwork.o
  CC       RUA_CauseTransport.o
  CC       RUA_CauseProtocol.o
  CC       RUA_CauseMisc.o
  CC       RUA_CriticalityDiagnostics.o
In file included from <https://jenkins.osmocom.org/jenkins/job/master-osmo-iuh/a1=default,a2=default,a3=default,label=osmocom-master-debian9/ws/deps/install/stow/libasn1c/include/asn1c/asn_SEQUENCE_OF.h>:8:0,
                 from ../../include/osmocom/rua/RUA_CriticalityDiagnostics-IE-List.h:14,
                 from ../../include/osmocom/rua/RUA_CriticalityDiagnostics.h:17,
                 from RUA_CriticalityDiagnostics.c:7:
../../include/osmocom/rua/RUA_CriticalityDiagnostics-IE-List.h:28:23: warning: ‘struct Member’ declared inside parameter list will not be visible outside of this definition or declaration
  A_SEQUENCE_OF(struct Member {
                       ^
<https://jenkins.osmocom.org/jenkins/job/master-osmo-iuh/a1=default,a2=default,a3=default,label=osmocom-master-debian9/ws/deps/install/stow/libasn1c/include/asn1c/asn_SET_OF.h>:17:16: note: in definition of macro ‘A_SET_OF’
   void (*free)(type *);   \
                ^~~~
../../include/osmocom/rua/RUA_CriticalityDiagnostics-IE-List.h:28:2: note: in expansion of macro ‘A_SEQUENCE_OF’
  A_SEQUENCE_OF(struct Member {
  ^~~~~~~~~~~~~
  CC       RUA_CriticalityDiagnostics-IE-List.o
  CC       RUA_TypeOfError.o
  CC       RUA_RUA-PDU.o
  CC       RUA_InitiatingMessage.o
In file included from <https://jenkins.osmocom.org/jenkins/job/master-osmo-iuh/a1=default,a2=default,a3=default,label=osmocom-master-debian9/ws/deps/install/stow/libasn1c/include/asn1c/asn_SEQUENCE_OF.h>:8:0,
                 from ../../include/osmocom/rua/RUA_CriticalityDiagnostics-IE-List.h:14,
                 from RUA_CriticalityDiagnostics-IE-List.c:7:
../../include/osmocom/rua/RUA_CriticalityDiagnostics-IE-List.h:28:23: warning: ‘struct Member’ declared inside parameter list will not be visible outside of this definition or declaration
  A_SEQUENCE_OF(struct Member {
                       ^
<https://jenkins.osmocom.org/jenkins/job/master-osmo-iuh/a1=default,a2=default,a3=default,label=osmocom-master-debian9/ws/deps/install/stow/libasn1c/include/asn1c/asn_SET_OF.h>:17:16: note: in definition of macro ‘A_SET_OF’
   void (*free)(type *);   \
                ^~~~
../../include/osmocom/rua/RUA_CriticalityDiagnostics-IE-List.h:28:2: note: in expansion of macro ‘A_SEQUENCE_OF’
  A_SEQUENCE_OF(struct Member {
  ^~~~~~~~~~~~~
  CC       RUA_SuccessfulOutcome.o
  CC       RUA_UnsuccessfulOutcome.o
  CC       RUA_Connect.o
  CC       RUA_DirectTransfer.o
  CC       RUA_Disconnect.o
  CC       RUA_ConnectionlessTransfer.o
  CC       RUA_ErrorIndication.o
  CC       RUA_PrivateMessage.o
  CC       RUA_IE.o
  AR       libosmo-asn1-rua.a
ar: `u' modifier ignored since `D' is the default (see `U')
make[4]: Leaving directory '<https://jenkins.osmocom.org/jenkins/job/master-osmo-iuh/a1=default,a2=default,a3=default,label=osmocom-master-debian9/ws/src/rua'>
Making all in ranap
make[4]: Entering directory '<https://jenkins.osmocom.org/jenkins/job/master-osmo-iuh/a1=default,a2=default,a3=default,label=osmocom-master-debian9/ws/src/ranap'>
  CC       RANAP_Criticality.lo
  CC       RANAP_Presence.lo
  CC       RANAP_PrivateIE-ID.lo
  CC       RANAP_ProcedureCode.lo
  CC       RANAP_TriggeringMessage.lo
  CC       RANAP_ProtocolIE-ID.lo
  CC       RANAP_IE-Extensions.lo
  CC       RANAP_ProtocolExtensionID.lo
  CC       RANAP_AccuracyFulfilmentIndicator.lo
  CC       RANAP_AllocationOrRetentionPriority.lo
  CC       RANAP_Alt-RAB-Parameters.lo
  CC       RANAP_Alt-RAB-Parameter-ExtendedGuaranteedBitrateInf.lo
  CC       RANAP_Alt-RAB-Parameter-ExtendedGuaranteedBitrates.lo
  CC       RANAP_Alt-RAB-Parameter-GuaranteedBitrateInf.lo
  CC       RANAP_Alt-RAB-Parameter-ExtendedGuaranteedBitrateList.lo
  CC       RANAP_Alt-RAB-Parameter-GuaranteedBitrateType.lo
  CC       RANAP_Alt-RAB-Parameter-GuaranteedBitrates.lo
  CC       RANAP_Alt-RAB-Parameter-GuaranteedBitrateList.lo
  CC       RANAP_Alt-RAB-Parameter-SupportedGuaranteedBitrateInf.lo
  CC       RANAP_Alt-RAB-Parameter-SupportedGuaranteedBitrates.lo
  CC       RANAP_Alt-RAB-Parameter-ExtendedMaxBitrateInf.lo
  CC       RANAP_Alt-RAB-Parameter-ExtendedMaxBitrates.lo
  CC       RANAP_Alt-RAB-Parameter-ExtendedMaxBitrateList.lo
  CC       RANAP_Alt-RAB-Parameter-MaxBitrateInf.lo
  CC       RANAP_Alt-RAB-Parameter-MaxBitrateType.lo
  CC       RANAP_Alt-RAB-Parameter-MaxBitrates.lo
  CC       RANAP_Alt-RAB-Parameter-MaxBitrateList.lo
  CC       RANAP_Alt-RAB-Parameter-SupportedMaxBitrateInf.lo
  CC       RANAP_Alt-RAB-Parameter-SupportedMaxBitrates.lo
  CC       RANAP_AlternativeRABConfigurationRequest.lo
  CC       RANAP_APN.lo
  CC       RANAP_AreaIdentity.lo
  CC       RANAP_Ass-RAB-Parameters.lo
  CC       RANAP_Ass-RAB-Parameter-ExtendedGuaranteedBitrateList.lo
  CC       RANAP_Ass-RAB-Parameter-ExtendedMaxBitrateList.lo
  CC       RANAP_Ass-RAB-Parameter-GuaranteedBitrateList.lo
  CC       RANAP_Ass-RAB-Parameter-MaxBitrateList.lo
In file included from <https://jenkins.osmocom.org/jenkins/job/master-osmo-iuh/a1=default,a2=default,a3=default,label=osmocom-master-debian9/ws/deps/install/stow/libasn1c/include/asn1c/asn_SEQUENCE_OF.h>:8:0,
                 from ../../include/osmocom/ranap/RANAP_IE-Extensions.h:15,
                 from ../../include/osmocom/ranap/RANAP_SAI.h:17,
                 from ../../include/osmocom/ranap/RANAP_AreaIdentity.h:14,
                 from RANAP_AreaIdentity.c:7:
../../include/osmocom/ranap/RANAP_GA-Polygon.h:26:23: warning: ‘struct Member’ declared inside parameter list will not be visible outside of this definition or declaration
  A_SEQUENCE_OF(struct Member {
                       ^
<https://jenkins.osmocom.org/jenkins/job/master-osmo-iuh/a1=default,a2=default,a3=default,label=osmocom-master-debian9/ws/deps/install/stow/libasn1c/include/asn1c/asn_SET_OF.h>:17:16: note: in definition of macro ‘A_SET_OF’
   void (*free)(type *);   \
                ^~~~
../../include/osmocom/ranap/RANAP_GA-Polygon.h:26:2: note: in expansion of macro ‘A_SEQUENCE_OF’
  A_SEQUENCE_OF(struct Member {
  ^~~~~~~~~~~~~
  CC       RANAP_AuthorisedPLMNs.lo
  CC       RANAP_AuthorisedSNAs.lo
  CC       RANAP_BindingID.lo
  CC       RANAP_BroadcastAssistanceDataDecipheringKeys.lo
  CC       RANAP_Cause.lo
  CC       RANAP_CauseMisc.lo
  CC       RANAP_CauseNAS.lo
  CC       RANAP_CauseProtocol.lo
In file included from <https://jenkins.osmocom.org/jenkins/job/master-osmo-iuh/a1=default,a2=default,a3=default,label=osmocom-master-debian9/ws/deps/install/stow/libasn1c/include/asn1c/asn_SEQUENCE_OF.h>:8:0,
                 from ../../include/osmocom/ranap/RANAP_AuthorisedPLMNs.h:14,
                 from RANAP_AuthorisedPLMNs.c:7:
../../include/osmocom/ranap/RANAP_AuthorisedPLMNs.h:27:23: warning: ‘struct MemberC’ declared inside parameter list will not be visible outside of this definition or declaration
  A_SEQUENCE_OF(struct MemberC {
                       ^
<https://jenkins.osmocom.org/jenkins/job/master-osmo-iuh/a1=default,a2=default,a3=default,label=osmocom-master-debian9/ws/deps/install/stow/libasn1c/include/asn1c/asn_SET_OF.h>:17:16: note: in definition of macro ‘A_SET_OF’
   void (*free)(type *);   \
                ^~~~
../../include/osmocom/ranap/RANAP_AuthorisedPLMNs.h:27:2: note: in expansion of macro ‘A_SEQUENCE_OF’
  A_SEQUENCE_OF(struct MemberC {
  ^~~~~~~~~~~~~
  CC       RANAP_CauseRadioNetwork.lo
  CC       RANAP_CauseRadioNetworkExtension.lo
  CC       RANAP_CauseNon-Standard.lo
  CC       RANAP_CauseTransmissionNetwork.lo
  CC       RANAP_Cell-Access-Mode.lo
  CC       RANAP_CellBased.lo
  CC       RANAP_CellIdList.lo
  CC       RANAP_Cell-Id.lo
  CC       RANAP_Cell-Capacity-Class-Value.lo
  CC       RANAP_CellLoadInformation.lo
  CC       RANAP_CellLoadInformationGroup.lo
  CC       RANAP_ClientType.lo
  CC       RANAP_CellType.lo
  CC       RANAP_CriticalityDiagnostics.lo
  CC       RANAP_CriticalityDiagnostics-IE-List.lo
  CC       RANAP_MessageStructure.lo
  CC       RANAP_CGI.lo
  CC       RANAP_ChosenEncryptionAlgorithm.lo
  CC       RANAP_ChosenIntegrityProtectionAlgorithm.lo
In file included from <https://jenkins.osmocom.org/jenkins/job/master-osmo-iuh/a1=default,a2=default,a3=default,label=osmocom-master-debian9/ws/deps/install/stow/libasn1c/include/asn1c/asn_SEQUENCE_OF.h>:8:0,
                 from ../../include/osmocom/ranap/RANAP_CriticalityDiagnostics-IE-List.h:14,
                 from ../../include/osmocom/ranap/RANAP_CriticalityDiagnostics.h:17,
                 from RANAP_CriticalityDiagnostics.c:7:
../../include/osmocom/ranap/RANAP_CriticalityDiagnostics-IE-List.h:28:23: warning: ‘struct MemberG’ declared inside parameter list will not be visible outside of this definition or declaration
  A_SEQUENCE_OF(struct MemberG {
                       ^
<https://jenkins.osmocom.org/jenkins/job/master-osmo-iuh/a1=default,a2=default,a3=default,label=osmocom-master-debian9/ws/deps/install/stow/libasn1c/include/asn1c/asn_SET_OF.h>:17:16: note: in definition of macro ‘A_SET_OF’
   void (*free)(type *);   \
                ^~~~
../../include/osmocom/ranap/RANAP_CriticalityDiagnostics-IE-List.h:28:2: note: in expansion of macro ‘A_SEQUENCE_OF’
  A_SEQUENCE_OF(struct MemberG {
  ^~~~~~~~~~~~~
In file included from <https://jenkins.osmocom.org/jenkins/job/master-osmo-iuh/a1=default,a2=default,a3=default,label=osmocom-master-debian9/ws/deps/install/stow/libasn1c/include/asn1c/asn_SEQUENCE_OF.h>:8:0,
                 from ../../include/osmocom/ranap/RANAP_CriticalityDiagnostics-IE-List.h:14,
                 from RANAP_CriticalityDiagnostics-IE-List.c:7:
../../include/osmocom/ranap/RANAP_CriticalityDiagnostics-IE-List.h:28:23: warning: ‘struct MemberG’ declared inside parameter list will not be visible outside of this definition or declaration
  A_SEQUENCE_OF(struct MemberG {
                       ^
<https://jenkins.osmocom.org/jenkins/job/master-osmo-iuh/a1=default,a2=default,a3=default,label=osmocom-master-debian9/ws/deps/install/stow/libasn1c/include/asn1c/asn_SET_OF.h>:17:16: note: in definition of macro ‘A_SET_OF’
   void (*free)(type *);   \
                ^~~~
../../include/osmocom/ranap/RANAP_CriticalityDiagnostics-IE-List.h:28:2: note: in expansion of macro ‘A_SEQUENCE_OF’
  A_SEQUENCE_OF(struct MemberG {
  ^~~~~~~~~~~~~
  CC       RANAP_CI.lo
  CC       RANAP_ClassmarkInformation2.lo
  CC       RANAP_ClassmarkInformation3.lo
In file included from <https://jenkins.osmocom.org/jenkins/job/master-osmo-iuh/a1=default,a2=default,a3=default,label=osmocom-master-debian9/ws/deps/install/stow/libasn1c/include/asn1c/asn_SEQUENCE_OF.h>:8:0,
                 from ../../include/osmocom/ranap/RANAP_MessageStructure.h:14,
                 from RANAP_MessageStructure.c:7:
../../include/osmocom/ranap/RANAP_MessageStructure.h:27:23: warning: ‘struct MemberL’ declared inside parameter list will not be visible outside of this definition or declaration
  A_SEQUENCE_OF(struct MemberL {
                       ^
<https://jenkins.osmocom.org/jenkins/job/master-osmo-iuh/a1=default,a2=default,a3=default,label=osmocom-master-debian9/ws/deps/install/stow/libasn1c/include/asn1c/asn_SET_OF.h>:17:16: note: in definition of macro ‘A_SET_OF’
   void (*free)(type *);   \
                ^~~~
../../include/osmocom/ranap/RANAP_MessageStructure.h:27:2: note: in expansion of macro ‘A_SEQUENCE_OF’
  A_SEQUENCE_OF(struct MemberL {
  ^~~~~~~~~~~~~
  CC       RANAP_CN-DomainIndicator.lo
  CC       RANAP_CN-ID.lo
  CC       RANAP_Correlation-ID.lo
  CC       RANAP_CSFB-Information.lo
  CC       RANAP_CSG-Id.lo
  CC       RANAP_CSG-Id-List.lo
  CC       RANAP_CSG-Membership-Status.lo
  CC       RANAP_DataPDUType.lo
  CC       RANAP_DataVolumeReference.lo
/bin/bash: line 1: 23931 Segmentation fault      /bin/bash ../../libtool --silent --tag=CC --mode=compile gcc -DPACKAGE_NAME=\"osmo-iuh\" -DPACKAGE_TARNAME=\"osmo-iuh\" -DPACKAGE_VERSION=\"0.3.0.11-319c\" -DPACKAGE_STRING=\"osmo-iuh\ 0.3.0.11-319c\" -DPACKAGE_BUGREPORT=\"openbsc at lists.osmocom.org\" -DPACKAGE_URL=\"\" -DSTDC_HEADERS=1 -DHAVE_SYS_TYPES_H=1 -DHAVE_SYS_STAT_H=1 -DHAVE_STDLIB_H=1 -DHAVE_STRING_H=1 -DHAVE_MEMORY_H=1 -DHAVE_STRINGS_H=1 -DHAVE_INTTYPES_H=1 -DHAVE_STDINT_H=1 -DHAVE_UNISTD_H=1 -DHAVE_DLFCN_H=1 -DLT_OBJDIR=\".libs/\" -DPACKAGE=\"osmo-iuh\" -DVERSION=\"0.3.0.11-319c\" -DSTDC_HEADERS=1 -I. -fsanitize=address -fsanitize=undefined -Wall -I../../include -I<https://jenkins.osmocom.org/jenkins/job/master-osmo-iuh/a1=default,a2=default,a3=default,label=osmocom-master-debian9/ws/deps/install/stow/libasn1c/include/> -I<https://jenkins.osmocom.org/jenkins/job/master-osmo-iuh/a1=default,a2=default,a3=default,label=osmocom-master-debian9/ws/deps/install/stow/libasn1c/include/asn1c> -I<https://jenkins.osmocom.org/jenkins/job/master-osmo-iuh/a1=default,a2=default,a3=default,label=osmocom-master-debian9/ws/deps/install/stow/libosmocore/include/> -g -O2 -fsanitize=address -fsanitize=undefined -Wall -MT RANAP_DataPDUType.lo -MD -MP -MF .deps/RANAP_DataPDUType.Tpo -c -o RANAP_DataPDUType.lo RANAP_DataPDUType.c
/bin/bash: line 1: 23497 Segmentation fault      /bin/bash ../../libtool --silent --tag=CC --mode=compile gcc -DPACKAGE_NAME=\"osmo-iuh\" -DPACKAGE_TARNAME=\"osmo-iuh\" -DPACKAGE_VERSION=\"0.3.0.11-319c\" -DPACKAGE_STRING=\"osmo-iuh\ 0.3.0.11-319c\" -DPACKAGE_BUGREPORT=\"openbsc at lists.osmocom.org\" -DPACKAGE_URL=\"\" -DSTDC_HEADERS=1 -DHAVE_SYS_TYPES_H=1 -DHAVE_SYS_STAT_H=1 -DHAVE_STDLIB_H=1 -DHAVE_STRING_H=1 -DHAVE_MEMORY_H=1 -DHAVE_STRINGS_H=1 -DHAVE_INTTYPES_H=1 -DHAVE_STDINT_H=1 -DHAVE_UNISTD_H=1 -DHAVE_DLFCN_H=1 -DLT_OBJDIR=\".libs/\" -DPACKAGE=\"osmo-iuh\" -DVERSION=\"0.3.0.11-319c\" -DSTDC_HEADERS=1 -I. -fsanitize=address -fsanitize=undefined -Wall -I../../include -I<https://jenkins.osmocom.org/jenkins/job/master-osmo-iuh/a1=default,a2=default,a3=default,label=osmocom-master-debian9/ws/deps/install/stow/libasn1c/include/> -I<https://jenkins.osmocom.org/jenkins/job/master-osmo-iuh/a1=default,a2=default,a3=default,label=osmocom-master-debian9/ws/deps/install/stow/libasn1c/include/asn1c> -I<https://jenkins.osmocom.org/jenkins/job/master-osmo-iuh/a1=default,a2=default,a3=default,label=osmocom-master-debian9/ws/deps/install/stow/libosmocore/include/> -g -O2 -fsanitize=address -fsanitize=undefined -Wall -MT RANAP_CSFB-Information.lo -MD -MP -MF .deps/RANAP_CSFB-Information.Tpo -c -o RANAP_CSFB-Information.lo RANAP_CSFB-Information.c
Makefile:2506: recipe for target 'RANAP_DataPDUType.lo' failed
make[4]: *** [RANAP_DataPDUType.lo] Error 139
make[4]: *** Waiting for unfinished jobs....
Makefile:2506: recipe for target 'RANAP_CSFB-Information.lo' failed
make[4]: *** [RANAP_CSFB-Information.lo] Error 139
make[4]: Leaving directory '<https://jenkins.osmocom.org/jenkins/job/master-osmo-iuh/a1=default,a2=default,a3=default,label=osmocom-master-debian9/ws/src/ranap'>
Makefile:642: recipe for target 'all-recursive' failed
make[3]: *** [all-recursive] Error 1
make[3]: Leaving directory '<https://jenkins.osmocom.org/jenkins/job/master-osmo-iuh/a1=default,a2=default,a3=default,label=osmocom-master-debian9/ws/src'>
Makefile:454: recipe for target 'all' failed
make[2]: *** [all] Error 2
make[2]: Leaving directory '<https://jenkins.osmocom.org/jenkins/job/master-osmo-iuh/a1=default,a2=default,a3=default,label=osmocom-master-debian9/ws/src'>
Makefile:458: recipe for target 'all-recursive' failed
make[1]: *** [all-recursive] Error 1
make[1]: Leaving directory '<https://jenkins.osmocom.org/jenkins/job/master-osmo-iuh/a1=default,a2=default,a3=default,label=osmocom-master-debian9/ws/'>
Makefile:382: recipe for target 'all' failed
make: *** [all] Error 2
Build step 'Execute shell' marked build as failure
[WARNINGS]Skipping publisher since build result is FAILURE


More information about the gerrit-log mailing list