Build failure of network:osmocom:latest/libosmocore in Debian_8.0/x86_64

OBS Notification admin at opensuse.org
Tue Oct 31 07:45:35 UTC 2017


Visit https://build.opensuse.org/package/live_build_log/network:osmocom:latest/libosmocore/Debian_8.0/x86_64

Package network:osmocom:latest/libosmocore failed to build in Debian_8.0/x86_64

Check out the package for editing:
  osc checkout network:osmocom:latest libosmocore

Last lines of build log:
[  244s] -[+] Testing: ??? (non-recursive, direct truncation, not punctured)
[  244s] -[.] Input length  : ret = 224  exp = 224 -> OK
[  244s] -[.] Output length : ret = 448  exp = 448 -> OK
[  244s] -[.] Pre computed vector checks:
[  244s] -[..] Encoding: OK
[  244s] -[..] Decoding: OK
[  244s] -[.] Random vector checks:
[  244s] -[..] Encoding / Decoding cycle : OK
[  244s] -[..] Encoding / Decoding cycle : OK
[  244s] -[..] Encoding / Decoding cycle : OK
[  244s] -
[  244s] ./testsuite.at:57: exit code was 132, expected 0
[  244s] 9. testsuite.at:54: 9. conv (testsuite.at:54): FAILED (testsuite.at:57)
[  244s] debian/rules:26: recipe for target 'override_dh_auto_test' failed
[  244s] make[1]: *** [override_dh_auto_test] Error 1
[  244s] make[1]: Leaving directory '/usr/src/packages/BUILD'
[  244s] debian/rules:15: recipe for target 'build' failed
[  244s] make: *** [build] Error 2
[  244s] dpkg-buildpackage: error: debian/rules build gave error exit status 2
[  244s] 
[  244s] build31 failed "build libosmocore_0.10.1.dsc" at Tue Oct 31 07:45:25 UTC 2017.
[  244s] 
[  244s] ### VM INTERACTION START ###
[  246s] Powering off.
[  246s] [  237.780391] reboot: Power down
[  246s] ### VM INTERACTION END ###
[  246s] 
[  246s] build31 failed "build libosmocore_0.10.1.dsc" at Tue Oct 31 07:45:27 UTC 2017.
[  246s] 

-- 
Configure notifications at https://build.opensuse.org/user/notifications
openSUSE Build Service (https://build.opensuse.org/)


More information about the gerrit-log mailing list