Build failure of network:osmocom:nightly/osmo-pcu in Debian_8.0/i586

OBS Notification admin at opensuse.org
Sat Oct 28 19:58:54 UTC 2017


Visit https://build.opensuse.org/package/live_build_log/network:osmocom:nightly/osmo-pcu/Debian_8.0/i586

Package network:osmocom:nightly/osmo-pcu failed to build in Debian_8.0/i586

Check out the package for editing:
  osc checkout network:osmocom:nightly osmo-pcu

Last lines of build log:
[  129s]    Subject: [osmo-pcu 0.3.0.20171028] testsuite: 2 3 5 6 7 8 11 failed
[  129s] 
[  129s] You may investigate any problem if you feel able to do so, in which
[  129s] case the test suite provides a good starting point.  Its output may
[  129s] be found below `tests/testsuite.dir'.
[  129s] 
[  129s] Makefile:1208: recipe for target 'check-local' failed
[  129s] make[3]: *** [check-local] Error 1
[  129s] make[3]: Leaving directory '/usr/src/packages/BUILD/tests'
[  129s] Makefile:1044: recipe for target 'check-am' failed
[  129s] make[2]: *** [check-am] Error 2
[  129s] make[2]: Leaving directory '/usr/src/packages/BUILD/tests'
[  129s] Makefile:448: recipe for target 'check-recursive' failed
[  129s] make[1]: *** [check-recursive] Error 1
[  129s] make[1]: Leaving directory '/usr/src/packages/BUILD'
[  129s] dh_auto_test: make -j1 check returned exit code 2
[  129s] debian/rules:12: recipe for target 'build' failed
[  129s] make: *** [build] Error 2
[  129s] dpkg-buildpackage: error: debian/rules build gave error exit status 2
[  129s] 
[  129s] lamb63 failed "build osmo-pcu_0.3.0.20171028.dsc" at Sat Oct 28 19:58:39 UTC 2017.
[  129s] 
[  129s] ### VM INTERACTION START ###
[  130s] Powering off.
[  130s] [  122.862726] reboot: Power down
[  130s] ### VM INTERACTION END ###
[  130s] 
[  130s] lamb63 failed "build osmo-pcu_0.3.0.20171028.dsc" at Sat Oct 28 19:58:41 UTC 2017.
[  130s] 

-- 
Configure notifications at https://build.opensuse.org/user/notifications
openSUSE Build Service (https://build.opensuse.org/)


More information about the gerrit-log mailing list