Build failure of network:osmocom:nightly/osmo-pcu in Debian_8.0/x86_64

OBS Notification admin at opensuse.org
Fri Oct 27 16:04:46 UTC 2017


Visit https://build.opensuse.org/package/live_build_log/network:osmocom:nightly/osmo-pcu/Debian_8.0/x86_64

Package network:osmocom:nightly/osmo-pcu failed to build in Debian_8.0/x86_64

Check out the package for editing:
  osc checkout network:osmocom:nightly osmo-pcu

Last lines of build log:
[  162s]    Subject: [osmo-pcu 0.3.0.20171027] testsuite: 2 3 5 6 7 8 11 failed
[  162s] 
[  162s] You may investigate any problem if you feel able to do so, in which
[  162s] case the test suite provides a good starting point.  Its output may
[  162s] be found below `tests/testsuite.dir'.
[  162s] 
[  162s] Makefile:1208: recipe for target 'check-local' failed
[  162s] make[3]: *** [check-local] Error 1
[  162s] make[3]: Leaving directory '/usr/src/packages/BUILD/tests'
[  162s] Makefile:1044: recipe for target 'check-am' failed
[  162s] make[2]: *** [check-am] Error 2
[  162s] make[2]: Leaving directory '/usr/src/packages/BUILD/tests'
[  162s] Makefile:448: recipe for target 'check-recursive' failed
[  162s] make[1]: *** [check-recursive] Error 1
[  162s] make[1]: Leaving directory '/usr/src/packages/BUILD'
[  162s] dh_auto_test: make -j1 check returned exit code 2
[  162s] debian/rules:12: recipe for target 'build' failed
[  162s] make: *** [build] Error 2
[  162s] dpkg-buildpackage: error: debian/rules build gave error exit status 2
[  162s] 
[  162s] lamb26 failed "build osmo-pcu_0.3.0.20171027.dsc" at Fri Oct 27 16:04:32 UTC 2017.
[  162s] 
[  162s] ### VM INTERACTION START ###
[  163s] Powering off.
[  163s] [  152.816643] reboot: Power down
[  163s] ### VM INTERACTION END ###
[  163s] 
[  163s] lamb26 failed "build osmo-pcu_0.3.0.20171027.dsc" at Fri Oct 27 16:04:33 UTC 2017.
[  163s] 

-- 
Configure notifications at https://build.opensuse.org/user/notifications
openSUSE Build Service (https://build.opensuse.org/)


More information about the gerrit-log mailing list