Build failure of network:osmocom:nightly/osmo-pcu in Debian_8.0/x86_64

OBS Notification admin at opensuse.org
Wed Oct 25 20:00:39 UTC 2017


Visit https://build.opensuse.org/package/live_build_log/network:osmocom:nightly/osmo-pcu/Debian_8.0/x86_64

Package network:osmocom:nightly/osmo-pcu failed to build in Debian_8.0/x86_64

Check out the package for editing:
  osc checkout network:osmocom:nightly osmo-pcu

Last lines of build log:
[  177s]    Subject: [osmo-pcu 0.3.0.20171025] testsuite: 2 3 5 6 7 8 11 failed
[  177s] 
[  177s] You may investigate any problem if you feel able to do so, in which
[  177s] case the test suite provides a good starting point.  Its output may
[  177s] be found below `tests/testsuite.dir'.
[  177s] 
[  177s] Makefile:1208: recipe for target 'check-local' failed
[  177s] make[3]: *** [check-local] Error 1
[  177s] make[3]: Leaving directory '/usr/src/packages/BUILD/tests'
[  177s] Makefile:1044: recipe for target 'check-am' failed
[  177s] make[2]: *** [check-am] Error 2
[  177s] make[2]: Leaving directory '/usr/src/packages/BUILD/tests'
[  177s] Makefile:448: recipe for target 'check-recursive' failed
[  177s] make[1]: *** [check-recursive] Error 1
[  177s] make[1]: Leaving directory '/usr/src/packages/BUILD'
[  177s] dh_auto_test: make -j1 check returned exit code 2
[  177s] debian/rules:12: recipe for target 'build' failed
[  177s] make: *** [build] Error 2
[  177s] dpkg-buildpackage: error: debian/rules build gave error exit status 2
[  177s] 
[  177s] lamb07 failed "build osmo-pcu_0.3.0.20171025.dsc" at Wed Oct 25 20:00:37 UTC 2017.
[  177s] 
[  177s] ### VM INTERACTION START ###
[  178s] Powering off.
[  178s] [  170.236575] reboot: Power down
[  178s] ### VM INTERACTION END ###
[  178s] 
[  178s] lamb07 failed "build osmo-pcu_0.3.0.20171025.dsc" at Wed Oct 25 20:00:38 UTC 2017.
[  178s] 

-- 
Configure notifications at https://build.opensuse.org/user/notifications
openSUSE Build Service (https://build.opensuse.org/)


More information about the gerrit-log mailing list