Build failure of network:osmocom:nightly/osmo-sgsn in xUbuntu_16.04/i586

OBS Notification admin at opensuse.org
Tue Oct 24 20:24:57 UTC 2017


Visit https://build.opensuse.org/package/live_build_log/network:osmocom:nightly/osmo-sgsn/xUbuntu_16.04/i586

Package network:osmocom:nightly/osmo-sgsn failed to build in xUbuntu_16.04/i586

Check out the package for editing:
  osc checkout network:osmocom:nightly osmo-sgsn

Last lines of build log:
[  156s]      VCI 0x1001, NSEI 0x1000, peer 0x01020304:1111
[  156s] +         Packets at NS Level  ( In): 5
[  156s] +         Packets at NS Level  (Out): 5
[  156s] +         Bytes at NS Level    ( In): 37
[  156s] +         Bytes at NS Level    (Out): 21
[  156s]      VCI 0x0101, NSEI 0x0100, peer 0x05060708:32000
[  156s] +         Packets at NS Level  ( In): 5
[  156s] +         Packets at NS Level  (Out): 5
[  156s] +         Bytes at NS Level    ( In): 21
[  156s] +         Bytes at NS Level    (Out): 37
[  156s]           NS-VC Block count         : 1
[  156s]  
[  156s]  Gbproxy global:
[  156s] 2. testsuite.at:10: 2. gbproxy (testsuite.at:10): FAILED (testsuite.at:13)
[  156s] debian/rules:65: recipe for target 'override_dh_auto_test' failed
[  156s] make[1]: *** [override_dh_auto_test] Error 1
[  156s] make[1]: Leaving directory '/usr/src/packages/BUILD'
[  156s] debian/rules:45: recipe for target 'build' failed
[  156s] make: *** [build] Error 2
[  156s] dpkg-buildpackage: error: debian/rules build gave error exit status 2
[  156s] 
[  156s] cloud122 failed "build osmo-sgsn_0.1.0.20171024.dsc" at Tue Oct 24 20:24:36 UTC 2017.
[  156s] 
[  156s] ### VM INTERACTION START ###
[  159s] [  145.048559] reboot: Power down
[  160s] ### VM INTERACTION END ###
[  160s] 
[  160s] cloud122 failed "build osmo-sgsn_0.1.0.20171024.dsc" at Tue Oct 24 20:24:41 UTC 2017.
[  160s] 

-- 
Configure notifications at https://build.opensuse.org/user/notifications
openSUSE Build Service (https://build.opensuse.org/)


More information about the gerrit-log mailing list