Build failure of network:osmocom:nightly/osmo-sgsn in xUbuntu_17.04/x86_64

OBS Notification admin at opensuse.org
Tue Oct 24 20:19:31 UTC 2017


Visit https://build.opensuse.org/package/live_build_log/network:osmocom:nightly/osmo-sgsn/xUbuntu_17.04/x86_64

Package network:osmocom:nightly/osmo-sgsn failed to build in xUbuntu_17.04/x86_64

Check out the package for editing:
  osc checkout network:osmocom:nightly osmo-sgsn

Last lines of build log:
[  121s] | #define HAVE_STDLIB_H 1
[  121s] | #define HAVE_STRING_H 1
[  121s] | #define HAVE_MEMORY_H 1
[  121s] | #define HAVE_STRINGS_H 1
[  121s] | #define HAVE_INTTYPES_H 1
[  121s] | #define HAVE_STDINT_H 1
[  121s] | #define HAVE_UNISTD_H 1
[  121s] | #define HAVE_DLFCN_H 1
[  121s] | #define LT_OBJDIR ".libs/"
[  121s] | #define STDC_HEADERS 1
[  121s] | #define HAVE_TM_GMTOFF_IN_TM 1
[  121s] | 
[  121s] | configure: exit 0
[  121s] 
[  121s] debian/rules:65: recipe for target 'override_dh_auto_test' failed
[  121s] make[1]: *** [override_dh_auto_test] Error 1
[  121s] make[1]: Leaving directory '/usr/src/packages/BUILD'
[  121s] debian/rules:45: recipe for target 'build' failed
[  121s] make: *** [build] Error 2
[  121s] dpkg-buildpackage: error: debian/rules build gave error exit status 2
[  121s] 
[  121s] build34 failed "build osmo-sgsn_0.1.0.20171024.dsc" at Tue Oct 24 20:19:10 UTC 2017.
[  121s] 
[  121s] ### VM INTERACTION START ###
[  123s] [  115.300899] reboot: Power down
[  124s] ### VM INTERACTION END ###
[  124s] 
[  124s] build34 failed "build osmo-sgsn_0.1.0.20171024.dsc" at Tue Oct 24 20:19:14 UTC 2017.
[  124s] 

-- 
Configure notifications at https://build.opensuse.org/user/notifications
openSUSE Build Service (https://build.opensuse.org/)


More information about the gerrit-log mailing list