Build failure of network:osmocom:nightly/osmo-hlr in Debian_9.0/x86_64

OBS Notification admin at opensuse.org
Thu Oct 12 20:08:57 UTC 2017


Visit https://build.opensuse.org/package/live_build_log/network:osmocom:nightly/osmo-hlr/Debian_9.0/x86_64

Package network:osmocom:nightly/osmo-hlr failed to build in Debian_9.0/x86_64

Check out the package for editing:
  osc checkout network:osmocom:nightly osmo-hlr

Last lines of build log:
[   93s] +DDB Unable to prepare SQL statement 'SELECT id,imsi,msisdn,vlr_number,sgsn_number,sgsn_address,periodic_lu_tmr,periodic_rau_tau_tmr,nam_cs,nam_ps,lmsi,ms_purged_cs,ms_purged_ps FROM subscriber WHERE imsi = ?'
[   93s] +Assert failed dbc db_test.c:811
[   93s] +/usr/src/packages/BUILD/tests/testsuite.dir/at-groups/4/test-source: line 27: 16773 Aborted                 $abs_top_builddir/tests/db/db_test
[   93s] --- expout	2017-10-12 20:08:48.820000000 +0000
[   93s] +++ /usr/src/packages/BUILD/tests/testsuite.dir/at-groups/4/stdout	2017-10-12 20:08:48.836000000 +0000
[   93s] @@ -1,2 +1,5 @@
[   93s]  db_test.c
[   93s] -Done
[   93s] +backtrace() returned 4 addresses
[   93s] +/usr/src/packages/BUILD/tests/db/db_test(+0xef41) [0x55fbe7892f41]
[   93s] +/lib/x86_64-linux-gnu/libc.so.6(__libc_start_main+0xf1) [0x7f2ceb6c52b1]
[   93s] +/usr/src/packages/BUILD/tests/db/db_test(+0xfdda) [0x55fbe7893dda]
[   93s] ./testsuite.at:30: exit code was 134, expected 0
[   93s] 4. testsuite.at:25: 4. db (testsuite.at:25): FAILED (testsuite.at:30)
[   93s] debian/rules:17: recipe for target 'override_dh_auto_test' failed
[   93s] make[1]: *** [override_dh_auto_test] Error 1
[   93s] make[1]: Leaving directory '/usr/src/packages/BUILD'
[   93s] debian/rules:7: recipe for target 'build' failed
[   93s] make: *** [build] Error 2
[   93s] dpkg-buildpackage: error: debian/rules build gave error exit status 2
[   93s] 
[   93s] lamb22 failed "build osmo-hlr_0.0.1.20171012.dsc" at Thu Oct 12 20:08:49 UTC 2017.
[   93s] 
[   93s] ### VM INTERACTION START ###
[   95s] [   87.132605] reboot: Power down
[   95s] ### VM INTERACTION END ###
[   95s] 
[   95s] lamb22 failed "build osmo-hlr_0.0.1.20171012.dsc" at Thu Oct 12 20:08:53 UTC 2017.
[   95s] 

-- 
Configure notifications at https://build.opensuse.org/user/notifications
openSUSE Build Service (https://build.opensuse.org/)


More information about the gerrit-log mailing list