Build failure of network:osmocom:nightly/osmo-hlr in xUbuntu_16.10/i586

OBS Notification admin at opensuse.org
Thu Oct 12 20:03:14 UTC 2017


Visit https://build.opensuse.org/package/live_build_log/network:osmocom:nightly/osmo-hlr/xUbuntu_16.10/i586

Package network:osmocom:nightly/osmo-hlr failed to build in xUbuntu_16.10/i586

Check out the package for editing:
  osc checkout network:osmocom:nightly osmo-hlr

Last lines of build log:
[   95s] +DDB Unable to prepare SQL statement 'SELECT id,imsi,msisdn,vlr_number,sgsn_number,sgsn_address,periodic_lu_tmr,periodic_rau_tau_tmr,nam_cs,nam_ps,lmsi,ms_purged_cs,ms_purged_ps FROM subscriber WHERE imsi = ?'
[   95s] +Assert failed dbc db_test.c:811
[   95s] +/usr/src/packages/BUILD/tests/testsuite.dir/at-groups/4/test-source: line 27: 19077 Aborted                 $abs_top_builddir/tests/db/db_test
[   95s] --- expout	2017-10-12 20:02:57.908000000 +0000
[   95s] +++ /usr/src/packages/BUILD/tests/testsuite.dir/at-groups/4/stdout	2017-10-12 20:02:57.944000000 +0000
[   95s] @@ -1,2 +1,5 @@
[   95s]  db_test.c
[   95s] -Done
[   95s] +backtrace() returned 4 addresses
[   95s] +/usr/src/packages/BUILD/tests/db/db_test(main+0x66dc) [0x5655f87c]
[   95s] +/lib/i386-linux-gnu/libc.so.6(__libc_start_main+0xf6) [0xf7404276]
[   95s] +/usr/src/packages/BUILD/tests/db/db_test(+0x7c78) [0x5655fc78]
[   95s] ./testsuite.at:30: exit code was 134, expected 0
[   95s] 4. testsuite.at:25: 4. db (testsuite.at:25): FAILED (testsuite.at:30)
[   95s] debian/rules:17: recipe for target 'override_dh_auto_test' failed
[   95s] make[1]: *** [override_dh_auto_test] Error 1
[   95s] make[1]: Leaving directory '/usr/src/packages/BUILD'
[   95s] debian/rules:7: recipe for target 'build' failed
[   95s] make: *** [build] Error 2
[   95s] dpkg-buildpackage: error: debian/rules build gave error exit status 2
[   95s] 
[   95s] lamb57 failed "build osmo-hlr_0.0.1.20171012.dsc" at Thu Oct 12 20:02:59 UTC 2017.
[   95s] 
[   95s] ### VM INTERACTION START ###
[   98s] [   90.408600] reboot: Power down
[   98s] ### VM INTERACTION END ###
[   98s] 
[   98s] lamb57 failed "build osmo-hlr_0.0.1.20171012.dsc" at Thu Oct 12 20:03:03 UTC 2017.
[   98s] 

-- 
Configure notifications at https://build.opensuse.org/user/notifications
openSUSE Build Service (https://build.opensuse.org/)


More information about the gerrit-log mailing list