Build failure of network:osmocom:nightly/osmo-trx in xUbuntu_16.04/i586

OBS Notification admin at opensuse.org
Wed Jan 25 20:08:11 UTC 2017


Visit https://build.opensuse.org/package/live_build_log/network:osmocom:nightly/osmo-trx/xUbuntu_16.04/i586

Package network:osmocom:nightly/osmo-trx failed to build in xUbuntu_16.04/i586

Check out the package for editing:
  osc checkout network:osmocom:nightly osmo-trx

Last lines of build log:
[  168s] libtool: compile:  g++ -DHAVE_CONFIG_H -I. -I/usr/src/packages/BUILD -I/usr/src/packages/BUILD/CommonLibs -I/usr/src/packages/BUILD/GSM -I/usr/src/packages/BUILD/sqlite3 -Wdate-time -D_FORTIFY_SOURCE=2 -Wall -O3 -g -ldl -lpthread -g -O2 -fstack-protector-strong -Wformat -Werror=format-security -c Timeval.cpp  -fPIC -DPIC -o .libs/Timeval.o
[  168s] /bin/bash /usr/src/packages/BUILD/libtool  --tag=CXX   --mode=compile g++ -DHAVE_CONFIG_H -I. -I/usr/src/packages/BUILD   -I/usr/src/packages/BUILD/CommonLibs -I/usr/src/packages/BUILD/GSM -I/usr/src/packages/BUILD/sqlite3 -Wdate-time -D_FORTIFY_SOURCE=2 -Wall -O3 -g -ldl -lpthread -g -O2 -fPIE -fstack-protector-strong -Wformat -Werror=format-security -c -o Reporting.lo Reporting.cpp
[  168s] libtool: compile:  g++ -DHAVE_CONFIG_H -I. -I/usr/src/packages/BUILD -I/usr/src/packages/BUILD/CommonLibs -I/usr/src/packages/BUILD/GSM -I/usr/src/packages/BUILD/sqlite3 -Wdate-time -D_FORTIFY_SOURCE=2 -Wall -O3 -g -ldl -lpthread -g -O2 -fstack-protector-strong -Wformat -Werror=format-security -c Reporting.cpp  -fPIC -DPIC -o .libs/Reporting.o
[  168s] In file included from Reporting.h:29:0,
[  168s]                  from Reporting.cpp:26:
[  168s] ./sqlite3util.h:4:21: fatal error: sqlite3.h: No such file or directory
[  168s] compilation terminated.
[  168s] Makefile:647: recipe for target 'Reporting.lo' failed
[  168s] make[3]: *** [Reporting.lo] Error 1
[  168s] make[3]: Leaving directory '/usr/src/packages/BUILD/CommonLibs'
[  168s] Makefile:499: recipe for target 'all-recursive' failed
[  168s] make[2]: *** [all-recursive] Error 1
[  168s] make[2]: Leaving directory '/usr/src/packages/BUILD'
[  168s] Makefile:430: recipe for target 'all' failed
[  168s] make[1]: *** [all] Error 2
[  168s] make[1]: Leaving directory '/usr/src/packages/BUILD'
[  168s] dh_auto_build: make -j1 returned exit code 2
[  168s] debian/rules:6: recipe for target 'build' failed
[  168s] make: *** [build] Error 2
[  168s] dpkg-buildpackage: error: debian/rules build gave error exit status 2
[  168s] 
[  168s] lamb56 failed "build osmo-trx_0.1.9.20170125.dsc" at Wed Jan 25 20:07:57 UTC 2017.
[  168s] 
[  168s] ### VM INTERACTION START ###
[  171s] [  121.967081] reboot: Power down
[  171s] ### VM INTERACTION END ###
[  171s] 
[  171s] lamb56 failed "build osmo-trx_0.1.9.20170125.dsc" at Wed Jan 25 20:08:01 UTC 2017.
[  171s] 

-- 
Configure notifications at https://build.opensuse.org/user/notifications
openSUSE Build Service (https://build.opensuse.org/)


More information about the gerrit-log mailing list