Build failure of network:osmocom:nightly/osmo-trx in Debian_8.0/x86_64

OBS Notification admin at opensuse.org
Wed Jan 25 20:07:54 UTC 2017


Visit https://build.opensuse.org/package/live_build_log/network:osmocom:nightly/osmo-trx/Debian_8.0/x86_64

Package network:osmocom:nightly/osmo-trx failed to build in Debian_8.0/x86_64

Check out the package for editing:
  osc checkout network:osmocom:nightly osmo-trx

Last lines of build log:
[  167s] In file included from Reporting.h:29:0,
[  167s]                  from Reporting.cpp:26:
[  167s] ./sqlite3util.h:4:21: fatal error: sqlite3.h: No such file or directory
[  167s]  #include <sqlite3.h>
[  167s]                      ^
[  167s] compilation terminated.
[  167s] Makefile:634: recipe for target 'Reporting.lo' failed
[  167s] make[3]: *** [Reporting.lo] Error 1
[  167s] make[3]: Leaving directory '/usr/src/packages/BUILD/CommonLibs'
[  167s] Makefile:487: recipe for target 'all-recursive' failed
[  167s] make[2]: *** [all-recursive] Error 1
[  167s] make[2]: Leaving directory '/usr/src/packages/BUILD'
[  167s] Makefile:417: recipe for target 'all' failed
[  167s] make[1]: *** [all] Error 2
[  167s] make[1]: Leaving directory '/usr/src/packages/BUILD'
[  167s] dh_auto_build: make -j1 returned exit code 2
[  167s] debian/rules:6: recipe for target 'build' failed
[  167s] make: *** [build] Error 2
[  167s] dpkg-buildpackage: error: debian/rules build gave error exit status 2
[  167s] 
[  167s] lamb59 failed "build osmo-trx_0.1.9.20170125.dsc" at Wed Jan 25 20:07:46 UTC 2017.
[  167s] 
[  167s] ### VM INTERACTION START ###
[  168s] Powering off.
[  168s] [  112.951565] reboot: Power down
[  168s] ### VM INTERACTION END ###
[  168s] 
[  168s] lamb59 failed "build osmo-trx_0.1.9.20170125.dsc" at Wed Jan 25 20:07:48 UTC 2017.
[  168s] 

-- 
Configure notifications at https://build.opensuse.org/user/notifications
openSUSE Build Service (https://build.opensuse.org/)


More information about the gerrit-log mailing list