Build failure of network:osmocom:nightly/osmo-trx in xUbuntu_16.10/i586

OBS Notification admin at opensuse.org
Wed Jan 25 20:07:03 UTC 2017


Visit https://build.opensuse.org/package/live_build_log/network:osmocom:nightly/osmo-trx/xUbuntu_16.10/i586

Package network:osmocom:nightly/osmo-trx failed to build in xUbuntu_16.10/i586

Check out the package for editing:
  osc checkout network:osmocom:nightly osmo-trx

Last lines of build log:
[  105s] /bin/bash /usr/src/packages/BUILD/libtool  --tag=CXX   --mode=compile g++ -DHAVE_CONFIG_H -I. -I/usr/src/packages/BUILD   -I/usr/src/packages/BUILD/CommonLibs -I/usr/src/packages/BUILD/GSM -I/usr/src/packages/BUILD/sqlite3 -Wdate-time -D_FORTIFY_SOURCE=2 -Wall -O3 -g -ldl -lpthread -g -O2 -fdebug-prefix-map=/usr/src/packages/BUILD=. -fPIE -fstack-protector-strong -Wformat -Werror=format-security -c -o Reporting.lo Reporting.cpp
[  105s] libtool: compile:  g++ -DHAVE_CONFIG_H -I. -I/usr/src/packages/BUILD -I/usr/src/packages/BUILD/CommonLibs -I/usr/src/packages/BUILD/GSM -I/usr/src/packages/BUILD/sqlite3 -Wdate-time -D_FORTIFY_SOURCE=2 -Wall -O3 -g -ldl -lpthread -g -O2 -fdebug-prefix-map=/usr/src/packages/BUILD=. -fstack-protector-strong -Wformat -Werror=format-security -c Reporting.cpp  -fPIC -DPIC -o .libs/Reporting.o
[  105s] In file included from Reporting.h:29:0,
[  105s]                  from Reporting.cpp:26:
[  105s] ./sqlite3util.h:4:21: fatal error: sqlite3.h: No such file or directory
[  105s]  #include <sqlite3.h>
[  105s]                      ^
[  105s] compilation terminated.
[  105s] Makefile:647: recipe for target 'Reporting.lo' failed
[  105s] make[3]: *** [Reporting.lo] Error 1
[  105s] make[3]: Leaving directory '/usr/src/packages/BUILD/CommonLibs'
[  105s] Makefile:499: recipe for target 'all-recursive' failed
[  105s] make[2]: *** [all-recursive] Error 1
[  105s] make[2]: Leaving directory '/usr/src/packages/BUILD'
[  105s] Makefile:430: recipe for target 'all' failed
[  105s] make[1]: *** [all] Error 2
[  105s] make[1]: Leaving directory '/usr/src/packages/BUILD'
[  105s] dh_auto_build: make -j1 returned exit code 2
[  105s] debian/rules:6: recipe for target 'build' failed
[  105s] make: *** [build] Error 2
[  105s] dpkg-buildpackage: error: debian/rules build gave error exit status 2
[  105s] 
[  105s] wildcard2 failed "build osmo-trx_0.1.9.20170125.dsc" at Wed Jan 25 20:06:44 UTC 2017.
[  105s] 
[  105s] ### VM INTERACTION START ###
[  109s] ### VM INTERACTION END ###
[  109s] 
[  109s] wildcard2 failed "build osmo-trx_0.1.9.20170125.dsc" at Wed Jan 25 20:06:48 UTC 2017.
[  109s] 

-- 
Configure notifications at https://build.opensuse.org/user/notifications
openSUSE Build Service (https://build.opensuse.org/)


More information about the gerrit-log mailing list