Build failure of network:osmocom:nightly/openggsn in Debian_8.0/i586

OBS Notification admin at opensuse.org
Thu Feb 23 19:56:07 UTC 2017


Visit https://build.opensuse.org/package/live_build_log/network:osmocom:nightly/openggsn/Debian_8.0/i586

Package network:osmocom:nightly/openggsn failed to build in Debian_8.0/i586

Check out the package for editing:
  osc checkout network:osmocom:nightly openggsn

Last lines of build log:
[   98s] cmdline.c:612:7: warning: variable 'check_required' set but not used [-Wunused-but-set-variable]
[   98s]    int check_required;
[   98s]        ^
[   99s]   CCLD     ggsn
[   99s] /usr/lib/i386-linux-gnu/libosmoctrl.so: undefined reference to `osmo_sock_init_ifd'
[   99s] collect2: error: ld returned 1 exit status
[   99s] Makefile:402: recipe for target 'ggsn' failed
[   99s] make[3]: *** [ggsn] Error 1
[   99s] make[3]: Leaving directory '/usr/src/packages/BUILD/ggsn'
[   99s] Makefile:473: recipe for target 'all-recursive' failed
[   99s] make[2]: *** [all-recursive] Error 1
[   99s] make[2]: Leaving directory '/usr/src/packages/BUILD'
[   99s] Makefile:373: recipe for target 'all' failed
[   99s] make[1]: *** [all] Error 2
[   99s] make[1]: Leaving directory '/usr/src/packages/BUILD'
[   99s] dh_auto_build: make -j1 returned exit code 2
[   99s] debian/rules:11: recipe for target 'build' failed
[   99s] make: *** [build] Error 2
[   99s] dpkg-buildpackage: error: debian/rules build gave error exit status 2
[   99s] 
[   99s] lamb23 failed "build openggsn_0.93.20170223.dsc" at Thu Feb 23 19:55:56 UTC 2017.
[   99s] 
[   99s] ### VM INTERACTION START ###
[  100s] Powering off.
[  100s] [   85.747502] reboot: Power down
[  100s] ### VM INTERACTION END ###
[  100s] 
[  100s] lamb23 failed "build openggsn_0.93.20170223.dsc" at Thu Feb 23 19:55:58 UTC 2017.
[  100s] 

-- 
Configure notifications at https://build.opensuse.org/user/notifications
openSUSE Build Service (https://build.opensuse.org/)


More information about the gerrit-log mailing list