Build failure of network:osmocom:nightly/openggsn in xUbuntu_16.04/i586

OBS Notification admin at opensuse.org
Thu Feb 23 19:55:33 UTC 2017


Visit https://build.opensuse.org/package/live_build_log/network:osmocom:nightly/openggsn/xUbuntu_16.04/i586

Package network:osmocom:nightly/openggsn failed to build in xUbuntu_16.04/i586

Check out the package for editing:
  osc checkout network:osmocom:nightly openggsn

Last lines of build log:
[  106s] cmdline.c:612:7: warning: variable 'check_required' set but not used [-Wunused-but-set-variable]
[  106s]    int check_required;
[  106s]        ^
[  107s] /bin/bash ../libtool  --tag=CC   --mode=link gcc -O2 -D_GNU_SOURCE -fno-builtin -Wall -DSBINDIR='"/usr/sbin"' -ggdb -I/usr/include/ -I/usr/include/  -g -O2 -fPIE -fstack-protector-strong -Wformat -Werror=format-security  -Wl,-Bsymbolic-functions -fPIE -pie -Wl,-z,relro -Wl,-z,now -o ggsn ggsn.o cmdline.o  -lgtp -L../gtp ../lib/libmisc.a -ltalloc -losmocore -ltalloc -losmoctrl -losmogsm -losmocore 
[  107s] libtool: link: gcc -O2 -D_GNU_SOURCE -fno-builtin -Wall -DSBINDIR=\"/usr/sbin\" -ggdb -I/usr/include/ -I/usr/include/ -g -O2 -fPIE -fstack-protector-strong -Wformat -Werror=format-security -Wl,-Bsymbolic-functions -fPIE -pie -Wl,-z -Wl,relro -Wl,-z -Wl,now -o .libs/ggsn ggsn.o cmdline.o  /usr/src/packages/BUILD/gtp/.libs/libgtp.so -L../gtp ../lib/libmisc.a -ltalloc /usr/lib/i386-linux-gnu/libosmoctrl.so /usr/lib/i386-linux-gnu/libosmogsm.so /usr/lib/i386-linux-gnu/libosmocore.so
[  107s] /usr/lib/i386-linux-gnu/libosmoctrl.so: undefined reference to `osmo_sock_init_ifd'
[  107s] collect2: error: ld returned 1 exit status
[  107s] Makefile:413: recipe for target 'ggsn' failed
[  107s] make[3]: *** [ggsn] Error 1
[  107s] make[3]: Leaving directory '/usr/src/packages/BUILD/ggsn'
[  107s] Makefile:485: recipe for target 'all-recursive' failed
[  107s] make[2]: *** [all-recursive] Error 1
[  107s] make[2]: Leaving directory '/usr/src/packages/BUILD'
[  107s] Makefile:386: recipe for target 'all' failed
[  107s] make[1]: *** [all] Error 2
[  107s] make[1]: Leaving directory '/usr/src/packages/BUILD'
[  107s] dh_auto_build: make -j1 returned exit code 2
[  107s] debian/rules:11: recipe for target 'build' failed
[  107s] make: *** [build] Error 2
[  107s] dpkg-buildpackage: error: debian/rules build gave error exit status 2
[  107s] 
[  107s] lamb27 failed "build openggsn_0.93.20170223.dsc" at Thu Feb 23 19:55:19 UTC 2017.
[  107s] 
[  107s] ### VM INTERACTION START ###
[  110s] [   97.458416] reboot: Power down
[  110s] ### VM INTERACTION END ###
[  110s] 
[  110s] lamb27 failed "build openggsn_0.93.20170223.dsc" at Thu Feb 23 19:55:22 UTC 2017.
[  110s] 

-- 
Configure notifications at https://build.opensuse.org/user/notifications
openSUSE Build Service (https://build.opensuse.org/)


More information about the gerrit-log mailing list