Build failure of network:osmocom:nightly/osmo-pcu in xUbuntu_16.10/i586

OBS Notification admin at opensuse.org
Thu Feb 23 19:54:41 UTC 2017


Visit https://build.opensuse.org/package/live_build_log/network:osmocom:nightly/osmo-pcu/xUbuntu_16.10/i586

Package network:osmocom:nightly/osmo-pcu failed to build in xUbuntu_16.10/i586

Check out the package for editing:
  osc checkout network:osmocom:nightly osmo-pcu

Last lines of build log:
[   75s]                                                                    ^~~~~~~~~~~~~~~~~~~
[   75s] gprs_debug.cpp:53:66: error: 'LOGGING_CTX_GB_BVC' was not declared in this scope
[   75s]   const struct gprs_nsvc *bvc = (const struct gprs_nsvc*)ctx->ctx[LOGGING_CTX_GB_BVC];
[   75s]                                                                   ^~~~~~~~~~~~~~~~~~
[   75s] gprs_debug.cpp:56:31: error: 'LOGGING_FILTER_GB_NSVC' was not declared in this scope
[   75s]   if ((tar->filter_map & (1 << LOGGING_FILTER_GB_NSVC)) != 0
[   75s]                                ^~~~~~~~~~~~~~~~~~~~~~
[   75s] gprs_debug.cpp:61:31: error: 'LOGGING_FILTER_GB_BVC' was not declared in this scope
[   75s]   if ((tar->filter_map & (1 << LOGGING_FILTER_GB_BVC)) != 0
[   75s]                                ^~~~~~~~~~~~~~~~~~~~~
[   75s] Makefile:778: recipe for target 'gprs_debug.lo' failed
[   75s] make[2]: *** [gprs_debug.lo] Error 1
[   75s] make[2]: Leaving directory '/usr/src/packages/BUILD/src'
[   75s] Makefile:403: recipe for target 'all-recursive' failed
[   75s] make[1]: *** [all-recursive] Error 1
[   75s] make[1]: Leaving directory '/usr/src/packages/BUILD'
[   75s] dh_auto_build: make -j1 returned exit code 2
[   75s] debian/rules:12: recipe for target 'build' failed
[   75s] make: *** [build] Error 2
[   75s] dpkg-buildpackage: error: debian/rules build gave error exit status 2
[   75s] 
[   75s] lamb22 failed "build osmo-pcu_0.3.20170223.dsc" at Thu Feb 23 19:54:32 UTC 2017.
[   75s] 
[   75s] ### VM INTERACTION START ###
[   78s] [   65.186688] reboot: Power down
[   78s] ### VM INTERACTION END ###
[   78s] 
[   78s] lamb22 failed "build osmo-pcu_0.3.20170223.dsc" at Thu Feb 23 19:54:36 UTC 2017.
[   78s] 

-- 
Configure notifications at https://build.opensuse.org/user/notifications
openSUSE Build Service (https://build.opensuse.org/)


More information about the gerrit-log mailing list